{"text_format":"1","workbook":"xlsx","n_sheets":12,"sheets":["Date","Fighters...","Humanoids","Characters","Undead","Animals","Monsters","Special","Encounter","Hero Points","Tables","Strength"],"not_rendered":{"charts":0,"images":2,"macros":1,"external_links":0,"defined_names":23,"comments":0,"pivot_tables":0},"unopened":[],"bounds":{"document_bytes":16777216,"sheet_cells":100000,"rows_first":2000,"rows_last":500,"rows_between":2000,"halvings":0,"cell_chars":16384,"cell_head_chars":4096},"cells_cut":0,"cells_raw":0,"read":"whole","date_system":"1900"}

{"sheet":"Date","index":0,"n_rows":34,"n_cols":14,"rows_kept":34,"cut":false,"hidden":false,"merged":[]}
[]
[]
[null,null,"January","February","March","April","May","June","July","August","September","October","November","December"]
[]
["Monday",null,1,1,1,1,1,1,1,1,1,1,1,1]
["Tuesday",null,2,2,2,2,2,2,2,2,2,2,2,2]
["Wednesday",null,3,3,3,3,3,3,3,3,3,3,3,3]
["Thursday",null,4,4,4,4,4,4,4,4,4,4,4,4]
["Friday",null,5,5,5,5,5,5,5,5,5,5,5,5]
["Saturday",null,6,6,6,6,6,6,6,6,6,6,6,6]
["Sunday",null,7,7,7,7,7,7,7,7,7,7,7,7]
["Monday",null,8,8,8,8,8,8,8,8,8,8,8,8]
["Tuesday",null,9,9,9,9,9,9,9,9,9,9,9,9]
["Wednesday",null,10,10,10,10,10,10,10,10,10,10,10,10]
["Thursday",null,11,11,11,11,11,11,11,11,11,11,11,11]
["Friday",null,12,12,12,12,12,12,12,12,12,12,12,12]
["Saturday",null,13,13,13,13,13,13,13,13,13,13,13,13]
["Sunday",null,14,14,14,14,14,14,14,14,14,14,14,14]
["Monday",null,15,15,15,15,15,15,15,15,15,15,15,15]
["Tuesday",null,16,16,16,16,16,16,16,16,16,16,16,16]
["Wednesday",null,17,17,17,17,17,17,17,17,17,17,17,17]
["Thursday",null,18,18,18,18,18,18,18,18,18,18,18,18]
["Friday",null,19,19,19,19,19,19,19,19,19,19,19,19]
["Saturday",null,20,20,20,20,20,20,20,20,20,20,20,20]
["Sunday",null,21,21,21,21,21,21,21,21,21,21,21,21]
["Monday",null,22,22,22,22,22,22,22,22,22,22,22,22]
["Tuesday",null,23,23,23,23,23,23,23,23,23,23,23,23]
["Wednesday",null,24,24,24,24,24,24,24,24,24,24,24,24]
["Thursday",null,25,25,25,25,25,25,25,25,25,25,25,25]
["Friday",null,26,26,26,26,26,26,26,26,26,26,26,26]
["Saturday",null,27,27,27,27,27,27,27,27,27,27,27,27]
["Sunday",null,28,28,28,28,28,28,28,28,28,28,28,28]
["Eoday",null,29,29,29,29,29,29,29,29,29,29,29,29]
["Dragonsday",null,30,30,30,30,30,30,30,30,30,30,30,30]

{"sheet":"Fighters...","index":1,"n_rows":39,"n_cols":43,"rows_kept":39,"cut":false,"hidden":false,"merged":[[0,20,0,21],[0,0,1,0],[0,1,1,1],[0,2,1,2],[0,9,0,10],[0,14,0,15],[0,6,0,8]]}
["Special","Save","Stamina Points",null,"Atk","Dmg \nbonus","Damage \nLevel",null,null,"Defence",null,"Absorb",null,null,"Armour",null,"Attack","Attack","Attack 2",null,"Health",null,"Size",null,null,null,null,"Attributes",null,null,null,"Flying","Ability"]
[null,null,null,null,null,null,"Dmg","Dmg","Dmg","Parry","Range","Cut","Thrust","Chop","Body","Shield","Type","Weapon",null,null,"SP","WP","feet","HD","Skill","Str","Int","Will","Con","Dex","Alert","Class",null,null,"Exp","total",null,null,null,null,"Weapon","Body Armour","Breast Plate"]
[null,null,null,null,null,null,null,null,null,null,null,null,null,null,null,null,null,null,null,null,null,null,null,null,null,null,null,null,null,null,null,null,null,null,null,null,null,null,null,null," - "," - ","-"]
[null,{"$f":"ROUNDUP((X4+Y4)/2,0)","v":1},{"$f":"U4","v":13},"New Trainee",{"$f":"Y4+ROUNDUP(AF4/2,0)+INT(+VLOOKUP(R4,weapons,3,FALSE)*MIN(Z4,8)+VLOOKUP(R4,weapons,4,FALSE)*(AD4))+VLOOKUP(W4,size,4)","v":1},{"$f":"Z4-VLOOKUP($W4,size,3)","v":0},{"$f":"VLOOKUP(VLOOKUP(R4,weapons,6,FALSE)+VLOOKUP($W4,size,3)+Y4-1,New_damage,2,FALSE)","v":"d6 / d4"},{"$f":"IF(S4<>\" - \",VLOOKUP(S4,weapons,3,FALSE)+VLOOKUP($W4,size,3),\" \")","v":" "}," ",{"$f":"INT(VLOOKUP(O4,body_armour,5,FALSE)+Y4+AE4+P4+VLOOKUP(W4,size,6)+(Z4+AD4)/2+VLOOKUP(R4,weapons,5,FALSE)/2 )","v":11},{"$f":"12+P4+VLOOKUP(W4,size,5)+AF4*3","v":13},{"$f":"VLOOKUP(VLOOKUP($O4,body_armour,2,FALSE)+IF($W4>6,INT(VLOOKUP($W4,size,7)),0),Armour_translation,2,FALSE)","v":1},{"$f":"VLOOKUP(VLOOKUP($O4,body_armour,3,FALSE)+IF($W4>6,INT(VLOOKUP($W4,size,7)),0),Armour_translation,2,FALSE)","v":1},{"$f":"VLOOKUP(VLOOKUP($O4,body_armour,4,FALSE)+IF($W4>6,INT(VLOOKUP($W4,size,7)),0),Armour_translation,2,FALSE)","v":1},"Padded",1,{"$f":"VLOOKUP(R4,weapons,2, FALSE)","v":"Slash"},"Arming Sword"," - "," - ",{"$f":"INT(W4+X4*(4.5+AC4))+3","v":13},{"$f":"2*(W4+AC4)","v":12},6,1,1,0,-1,-2,0,0,0,null,null,null,{"$f":"(5+E4)*(10+IF(AF4>0,K4,J4))*((10+F4+G4))*U4*(5+N4)/1000*VLOOKUP(AG4,Specials,3,FALSE)+VLOOKUP(AG4,Specials,2,FALSE)","v":{"$error":"#VALUE!"}},{"$f":"AH4*AI4*VLOOKUP(AH4,Attackers,2,TRUE)","v":{"$error":"#VALUE!"}},null,7,26,null,"Claw","Leather","Leather"]
[null,2,{"$f":"U5","v":18},"Apprentice",2,1,"d8 / d4"," "," ",12,13,1,1,1,"Padded",1,"Slash","Arming Sword"," - "," - ",18,12,6,2,2,1,-1,-1,0,0,0,null,null,null,{"$error":"#VALUE!"},{"$error":"#VALUE!"},null,-3,4,null,"Thump","Padded","Metal"]
[null,3,25,"Base guard",3,1,"d8 / d6"," "," ",13,13,"3/4",1,"3/4","Boiled Leather",1,"Slash","Arming Sword"," - "," - ",25,14,6,3,3,1,-1,0,1,0,1,null,null,null,{"$error":"#VALUE!"},{"$error":"#VALUE!"},null,-2,6,null,"Bite","Scale (Leather)"]
[null,4,31,"Corporal / Merc",5,2,"d10 / d6"," "," ",14,13,"1/2","1/2","1/2","Scale (Iron)",1,"Slash","Arming Sword"," - "," - ",31,14,6,4,4,2,0,1,1,1,1,null,null,null,{"$error":"#VALUE!"},{"$error":"#VALUE!"},null,-3,4,null,"Cleaver","Boiled Leather"]
[null,5,41,"Seargent / Man at Arms",6,3,"2d12"," "," ",17,14,"1/4","1/2","3/4","Mail Hauberk",2,"Slash","Bastard Sword"," - "," - ",41,16,6,5,5,3,1,1,2,0,2,null,null,null,{"$error":"#VALUE!"},{"$error":"#VALUE!"},null,-3,4,null,"Bow - Short","Scale (Iron)"]
[null,6,48,"Low Knight 1",7,2,"2d12+d2"," "," ",16,14,"1/4","1/2","3/4","Mail",2,"Slash","Bastard Sword"," - "," - ",48,16,6,6,6,2,0,1,2,1,0,null,null,null,{"$error":"#VALUE!"},{"$error":"#VALUE!"},null,-3,4,null,"Bow - Long","Mail Hauberk"]
[null,7,54,"Low Knight 2",8,2,"2d12 + d4"," "," ",18,15,"1/4","1/3","1/2","Coat of Plates",3,"Slash","Bastard Sword"," - "," - ",54,16,6,7,7,2,1,1,2,0,0,null,null,null,{"$error":"#VALUE!"},{"$error":"#VALUE!"},null,-1,8,null,"Crossbow","Mail"]
[null,8,69,"Knight",10,2,"2d12 + 2d4"," "," ",18,12,"1/4","1/3","1/2","Coat of Plates",null,"Slash","Bastard Sword"," - "," - ",69,18,6,8,8,2,1,2,3,2,1,null,null,null,{"$error":"#VALUE!"},{"$error":"#VALUE!"},null,0,11,null,"Battle-axe","Coat of Plates"]
[null,9,76,"Top Knight",12,3,"2d12+d2"," "," ",17,12,"1/5","1/4","1/3","Plate",null,"Bludgeon","Mace"," - "," - ",76,18,6,9,9,3,2,2,3,0,2,null,null,null,{"$error":"#VALUE!"},{"$error":"#VALUE!"},null,1,14,null,"Battle-axe 2 hands","Plate"]
[null,10,84,"Local Champion",14,4,"2d12 + d8 / d6"," "," ",20,12,"1/5","1/4","1/3","Plate",null,"Slash","Battle-axe 2 hands"," - "," - ",84,18,6,10,10,4,0,0,3,2,2,null,null,null,{"$error":"#VALUE!"},{"$error":"#VALUE!"},null,2,16,null,"Hand Axe","Hide"]
[null,11,91,"Champion",15,4,"2d12 + d10/d6"," "," ",22,12,"1/5","1/4","1/3","Plate",null,"Slash","Battle-axe 2 hands"," - "," - ",91,18,6,11,11,4,1,0,3,2,3,null,null,null,{"$error":"#VALUE!"},{"$error":"#VALUE!"},null,3,18,null,"War Hammer","Thick Hide"]
[null,12,111,"King's Champion",17,5,"2d12 + d10 / d8"," "," ",24,12,"1/5","1/4","1/3","Plate",null,"Slash","Battle-axe 2 hands"," - "," - ",111,20,6,12,12,5,1,1,4,2,3,null,null,null,{"$error":"#VALUE!"},{"$error":"#VALUE!"},null,4,20,null,"Club","Scales"]
[null,0,null,null,5,4,"d12 / d8",{"$error":"#N/A"},{"$error":"#N/A"},{"$error":"#N/A"},17,{"$error":"#N/A"},{"$error":"#N/A"},{"$error":"#N/A"},null,null,null,"Arming Sword",null,null,null,null,null,null,null,null,null,null,null,null,null,null,null,null,{"$error":"#N/A"},null,null,5,22,null,"Mace","Armoured scales"]
[null,{"$f":"ROUNDUP((X17+Y17)/2,0)","v":2},{"$f":"U17","v":20},"Smuggler",4,2,"d6 / d4"," "," ",11,12,"3/4",1,"3/4","Boiled Leather",0,{"$f":"VLOOKUP(R17,weapons,2, FALSE)","v":"Chop"},"Cutlass"," - "," - ",{"$f":"INT(W17+X17*(4.5+AC17))+3","v":20},{"$f":"2*(W17+AC17)","v":14},6,2,2,2,-1,-1,1,0,1,null,null,16,{"$error":"#VALUE!"},{"$f":"AH17*AI17*VLOOKUP(AH17,Attackers,2,TRUE)","v":{"$error":"#VALUE!"}},null,null,null,null,"Spear 2 hands"]
[null,{"$f":"ROUNDUP((X18+Y18)/2,0)","v":4},{"$f":"U18","v":31},"Mate / Bosun",6,2,"d8 / d6"," "," ",14,12,"3/4",1,"3/4","Boiled Leather",0,{"$f":"VLOOKUP(R18,weapons,2, FALSE)","v":"Chop"},"Cutlass"," - "," - ",{"$f":"INT(W18+X18*(4.5+AC18))+3","v":31},{"$f":"2*(W18+AC18)","v":14},6,4,4,2,-1,0,1,0,2,null,null,1,{"$error":"#VALUE!"},{"$f":"AH18*AI18*VLOOKUP(AH18,Attackers,2,TRUE)","v":{"$error":"#VALUE!"}},null,null,null,null,"Dagger"]
[null,{"$f":"ROUNDUP((X19+Y19)/2,0)","v":6},{"$f":"U19","v":41},"Captain",7,3,"d12 / d10"," "," ",16,12,"1/4","1/2","3/4","Mail Hauberk",0,{"$f":"VLOOKUP(R19,weapons,2, FALSE)","v":"Slash"},"Arming Sword"," - "," - ",{"$f":"INT(W19+X19*(4.5+AC19))+3","v":41},{"$f":"2*(W19+AC19)","v":16},6,5,6,3,1,1,2,0,2,null,null,1,{"$error":"#VALUE!"},{"$f":"AH19*AI19*VLOOKUP(AH19,Attackers,2,TRUE)","v":{"$error":"#VALUE!"}}]
[null,0,null,null,{"$error":"#N/A"},4,{"$error":"#N/A"},{"$f":"IF(S20<>\" - \",VLOOKUP(S20,weapons,3,FALSE)+VLOOKUP($W20,size,3),\" \")","v":{"$error":"#N/A"}},{"$error":"#N/A"},{"$error":"#N/A"},17,{"$error":"#N/A"},{"$error":"#N/A"},{"$error":"#N/A"},null,null,null,null,null,null,null,null,null,null,null,null,null,null,null,null,null,null,null,null,{"$error":"#N/A"},null,null,10,32,null,"Cutlass"]
[null,0,null,null,{"$error":"#N/A"},4,{"$error":"#N/A"},{"$error":"#N/A"},{"$error":"#N/A"},{"$error":"#N/A"},17,{"$error":"#N/A"},{"$error":"#N/A"},{"$error":"#N/A"},null,null,null,null,null,null,null,null,null,null,null,null,null,null,null,null,null,null,null,null,{"$error":"#N/A"},null,null,null,null,null,"Falchion"]
[null,0,null,null,{"$error":"#N/A"},4,{"$error":"#N/A"},{"$error":"#N/A"},{"$error":"#N/A"},{"$error":"#N/A"},17,{"$error":"#N/A"},{"$error":"#N/A"},{"$error":"#N/A"},null,null,null,null,null,null,null,null,null,null,null,null,null,null,null,null,null,null,null,null,{"$error":"#N/A"},null,null,null,null,null,"Short sword"]
[null,0,null,null,{"$error":"#N/A"},4,{"$error":"#N/A"},{"$error":"#N/A"},{"$error":"#N/A"},{"$error":"#N/A"},17,{"$error":"#N/A"},{"$error":"#N/A"},{"$error":"#N/A"},null,null,null,null,null,null,null,null,null,null,null,null,null,null,null,null,null,null,null,null,{"$error":"#N/A"},null,null,null,null,null,"Scimitar"]
[null,0,null,null,{"$error":"#N/A"},4,{"$error":"#N/A"},{"$error":"#N/A"},{"$error":"#N/A"},{"$error":"#N/A"},17,{"$error":"#N/A"},{"$error":"#N/A"},{"$error":"#N/A"},null,null,null,null,null,null,null,null,null,null,null,null,null,null,null,null,null,null,null,null,{"$error":"#N/A"},null,null,null,null,null,"Arming Sword"]
[null,0,null,null,{"$error":"#N/A"},4,{"$error":"#N/A"},{"$error":"#N/A"},{"$error":"#N/A"},{"$error":"#N/A"},17,{"$error":"#N/A"},{"$error":"#N/A"},{"$error":"#N/A"},null,null,null,null,null,null,null,null,null,null,null,null,null,null,null,null,null,null,null,null,{"$error":"#N/A"},null,null,null,null,null,"Bastard Sword"]
[null,0,null,null,{"$error":"#N/A"},4,{"$error":"#N/A"},{"$error":"#N/A"},{"$error":"#N/A"},{"$error":"#N/A"},17,{"$error":"#N/A"},{"$error":"#N/A"},{"$error":"#N/A"},null,null,null,null,null,null,null,null,null,null,null,null,null,null,null,null,null,null,null,null,{"$error":"#N/A"},null,null,null,null,null,"Great Sword"]
[null,0,null,null,{"$error":"#N/A"},4,{"$error":"#N/A"},{"$error":"#N/A"},{"$error":"#N/A"},{"$error":"#N/A"},17,{"$error":"#N/A"},{"$error":"#N/A"},{"$error":"#N/A"},null,null,null,null,null,null,null,null,null,null,null,null,null,null,null,null,null,null,null,null,{"$error":"#N/A"},null,null,null,null,null,"Staff"]
[null,0,null,null,{"$error":"#N/A"},4,{"$error":"#N/A"},{"$error":"#N/A"},{"$error":"#N/A"},{"$error":"#N/A"},17,{"$error":"#N/A"},{"$error":"#N/A"},{"$error":"#N/A"},null,null,null,null,null,null,null,null,null,null,null,null,null,null,null,null,null,null,null,null,{"$error":"#N/A"},null,null,null,null,null,"Missile"]
[null,0,null,null,{"$error":"#N/A"},4,{"$error":"#N/A"},{"$error":"#N/A"},{"$error":"#N/A"},{"$error":"#N/A"},17,{"$error":"#N/A"},{"$error":"#N/A"},{"$error":"#N/A"},null,null,null,null,null,null,null,null,null,null,null,null,null,null,null,null,null,null,null,null,{"$error":"#N/A"}]
[null,0,null,null,{"$error":"#N/A"},4,{"$error":"#N/A"},{"$error":"#N/A"},{"$error":"#N/A"},{"$error":"#N/A"},17,{"$error":"#N/A"},{"$error":"#N/A"},{"$error":"#N/A"},null,null,null,null,null,null,null,null,null,null,null,null,null,null,null,null,null,null,null,null,{"$error":"#N/A"}]
[null,0,null,null,{"$error":"#N/A"},4,{"$error":"#N/A"},{"$error":"#N/A"},{"$error":"#N/A"},{"$error":"#N/A"},17,{"$error":"#N/A"},{"$error":"#N/A"},{"$error":"#N/A"},null,null,null,null,null,null,null,null,null,null,null,null,null,null,null,null,null,null,null,null,{"$error":"#N/A"}]
[null,{"$f":"ROUNDUP((X32+Y32)/2,0)","v":0},null,null,{"$error":"#N/A"},4,{"$error":"#N/A"},{"$error":"#N/A"},{"$error":"#N/A"},{"$error":"#N/A"},17,{"$error":"#N/A"},{"$error":"#N/A"},{"$error":"#N/A"},null,null,null,null,null,null,null,null,null,null,null,null,null,null,null,null,null,null,null,null,{"$error":"#N/A"}]
[null,null,null,null,{"$error":"#N/A"},4,{"$error":"#N/A"},{"$error":"#N/A"},{"$error":"#N/A"},{"$error":"#N/A"},17,{"$error":"#N/A"},{"$error":"#N/A"},{"$error":"#N/A"},null,null,null,null,null,null,null,null,null,null,null,null,null,null,null,null,null,null,null,null,{"$error":"#N/A"}]
[null,null,null,null,{"$error":"#N/A"},4,{"$error":"#N/A"},{"$error":"#N/A"},{"$error":"#N/A"},{"$error":"#N/A"},17,{"$error":"#N/A"},{"$error":"#N/A"},{"$error":"#N/A"},null,null,null,null,null,null,null,null,null,null,null,null,null,null,null,null,null,null,null,null,{"$error":"#N/A"}]
[null,null,null,null,{"$error":"#N/A"},4,{"$error":"#N/A"},{"$error":"#N/A"},{"$error":"#N/A"},{"$error":"#N/A"},17,{"$error":"#N/A"},{"$error":"#N/A"},{"$error":"#N/A"},null,null,null,null,null,null,null,null,null,null,null,null,null,null,null,null,null,null,null,null,{"$error":"#N/A"}]
[null,null,null,null,{"$error":"#N/A"},4,{"$error":"#N/A"},{"$error":"#N/A"},{"$error":"#N/A"},{"$error":"#N/A"},17,{"$error":"#N/A"},{"$error":"#N/A"},{"$error":"#N/A"}]
[null,null,null,null,{"$error":"#N/A"},4,{"$error":"#N/A"},{"$error":"#N/A"},{"$error":"#N/A"},{"$error":"#N/A"},17,{"$error":"#N/A"},{"$error":"#N/A"},{"$error":"#N/A"}]
[null,null,null,null,{"$error":"#N/A"},4,{"$error":"#N/A"},{"$error":"#N/A"},{"$error":"#N/A"},{"$error":"#N/A"},17,{"$error":"#N/A"},{"$error":"#N/A"},{"$error":"#N/A"}]
[null,null,null,null,{"$f":"Y39+ROUNDUP(AF39/2,0)+INT(+VLOOKUP(R39,weapons,3,FALSE)*MIN(Z39,8)+VLOOKUP(R39,weapons,4,FALSE)*(AD39+VLOOKUP(O39,body_armour,5,FALSE)))+VLOOKUP(W39,size,4)","v":{"$error":"#N/A"}},4,{"$error":"#N/A"},{"$f":"IF(S39<>\" - \",VLOOKUP(S39,weapons,3,FALSE)+VLOOKUP($W39,size,3),\" \")","v":{"$error":"#N/A"}},{"$f":"IF(T39<>\" - \",VLOOKUP(T39,weapons,3,FALSE)+VLOOKUP($W39,size,3),\" \")","v":{"$error":"#N/A"}},{"$f":"INT(VLOOKUP(O39,body_armour,9,FALSE)+Y39+AE39+P39+VLOOKUP(W39,size,6)+(Z39+AD39)/2+VLOOKUP(R39,weapons,5,FALSE)/2 )","v":{"$error":"#N/A"}},{"$f":"12+P39+VLOOKUP(W39,size,5)+AF39*3","v":17}]

{"sheet":"Humanoids","index":2,"n_rows":38,"n_cols":43,"rows_kept":38,"cut":false,"hidden":false,"merged":[[0,14,0,15],[0,0,1,0],[0,1,1,1],[0,2,1,2],[0,6,0,8],[0,9,0,10]]}
["Special","Save","Stamina Points",null,"Atk","Dmg \nbonus","Damage \nLevel",null,null,"Defence",null,"Absorb",null,null,"Armour",null,"Attack","Attack","Attack 2","Attack 3","Health",null,"Size",null,null,null,null,"Attributes",null,null,null,"Flying","Ability"]
[null,null,null,null,null,null,"Dmg","Dmg","Dmg","Parry","Range","Cut","Thrust","Chop","Body","Shield","Type","Weapon",null,null,"SP","WP","feet","HD","Skill","Str","Int","Will","Con","Dex","Alert","Class",null,null,"Exp","total",null,null,null,null,"Weapon","Body Armour","Breast Plate"]
[null,null,null,null,null,null,null,null,null,null,null,null,null,null,null,null,null,null,null,null,null,null,null,null,null,null,null,null,null,null,null,null,null,null,null,null,null,null,null,null," - "," - ","-"]
[null,{"$f":"ROUNDUP((X4+Y4)/2,0)","v":2},{"$f":"U4","v":11},"Kobold",{"$f":"Y4+ROUNDUP(AF4/2,0)+INT(+VLOOKUP(R4,weapons,3,FALSE)*MIN(Z4,8)+VLOOKUP(R4,weapons,4,FALSE)*(AD4))+VLOOKUP(W4,size,4)","v":2},{"$f":"Z4-VLOOKUP($W4,size,3)","v":-2},{"$f":"VLOOKUP(VLOOKUP(R4,weapons,6,FALSE)+VLOOKUP($W4,size,3)+VLOOKUP(R4,weapons,8,FALSE)*(Y4-1),New_damage,2,FALSE)","v":"2d4"},{"$f":"IF(S4<>\" - \",VLOOKUP(S4,weapons,3,FALSE)+VLOOKUP($W4,size,3),\" \")","v":" "}," ",{"$f":"INT(VLOOKUP(O4,body_armour,5,FALSE)+Y4+AE4+P4+VLOOKUP(W4,size,6)+(Z4+AD4)/2+VLOOKUP(R4,weapons,5,FALSE)/2 )","v":14},{"$f":"12+P4+VLOOKUP(W4,size,5)+AF4*3","v":13},{"$f":"VLOOKUP(VLOOKUP($O4,body_armour,2,FALSE)+IF($W4>6,INT(VLOOKUP($W4,size,7)),0),Armour_translation,2,FALSE)","v":1},{"$f":"VLOOKUP(VLOOKUP($O4,body_armour,3,FALSE)+IF($W4>6,INT(VLOOKUP($W4,size,7)),0),Armour_translation,2,FALSE)","v":1.5},{"$f":"VLOOKUP(VLOOKUP($O4,body_armour,4,FALSE)+IF($W4>6,INT(VLOOKUP($W4,size,7)),0),Armour_translation,2,FALSE)","v":1.5},"Scales",1,{"$f":"VLOOKUP(R4,weapons,2, FALSE)","v":"Pierce"},"Spear"," - "," - ",{"$f":"INT(W4+X4*(4.5+AC4))+3","v":11},{"$f":"2*(W4+AC4)","v":12},6,0.5,2,-2,0,0,0,0,0,null,null,null,{"$f":"(5+E4)*(10+VLOOKUP(R4,weapons,6,FALSE)+Y4)*U4*(5+VLOOKUP(O4,body_armour,6,FALSE))/1000*VLOOKUP(AG4,Specials,3,FALSE)+VLOOKUP(AG4,Specials,2,FALSE)","v":10.78},{"$f":"AH4*AI4*VLOOKUP(AH4,Attackers,2,TRUE)","v":0},null,7,26,null,"Claw","Leather","Leather"]
[null,2,{"$f":"U5","v":10},"Kobold - leader",2,1,"d8 / d4",{"$f":"IF(S5<>\" - \",VLOOKUP(S5,weapons,3,FALSE)+VLOOKUP($W5,size,3),\" \")","v":" "},{"$f":"IF(T5<>\" - \",VLOOKUP(T5,weapons,3,FALSE)+VLOOKUP($W5,size,3),\" \")","v":" "},13,{"$f":"12+P5+VLOOKUP(W5,size,5)+AF5*3","v":14},1,1.5,1.5,"Scales",0,"Pierce","Spear 2 hands"," - "," - ",{"$f":"INT(W5+X5*(4.5+AC5))+3","v":10},6,3,1,3,-1,1,0,0,1,0,null,null,null,12.413333333333334,0,null,-3,4,null,"Thump","Padded","Metal"]
[null,4,18,"Kobold - chief",6,0,"d12 / d10"," "," ",16,12,1,1,1,"Hide",0,"Pierce","Spear 2 hands"," - "," - ",18,12,6,2,5,0,1,0,0,1,0,null,null,null,40.748400000000004,0,null,-3,4,null,"Bite","Scale (Leather)"]
[null,4,32,"Kobold - Giant",5,-1,"d10 / d8"," "," ",13,11,"1/3","1/2","3/4","Thick Hide",0,"Pierce","Spear 2 hands"," - "," - ",32,16,7,4,3,0,1,0,1,1,0,null,null,null,69.311999999999998,0,null,-3,4,null,"Hug","Boiled Leather"]
[null,2,11,"Goblin",3,3,"2d4"," "," ",12,14,"3/4",1,"3/4","Boiled Leather",1,"Pierce","Short sword"," - "," - ",11,8,4,1,2,2,-2,-2,0,2,1,null,null,null,14.173866666666667,0,null,-3,4,null,"Cleaver","Scale (Iron)"]
[null,1,9,"Goblin - archer",3,2,"d4"," "," ",11,13,1,1,1,"Padded",0,"Pierce","Bow - Short"," - "," - ",9,8,4,0.5,1,1,-1,-1,0,3,1,null,null,null,10.368,0,null,-2,6,null,"Bow - Short","Mail Hauberk"]
[null,3,18,"Goblin - leader",6,3,"d8 / d6"," "," ",14,15,"1/4","1/2","3/4","Mail Hauberk",2,"Bludgeon","Morning Star-Flail"," - "," - ",18,10,4,2,4,2,-1,0,1,3,1,null,null,null,43.388400000000004,0,null,-1,8,null,"Bow - Long","Mail"]
[null,4,24,"Goblin - Chief",9,4,"d10 / d6"," "," ",16,14,"1/2","1/2","1/2","Scale (Iron)",2,"Pierce","Morning Star"," - "," - ",24,11,4.5,3,5,4,0,0,1,2,1,null,null,null,71.500799999999984,0,null,0,11,null,"Crossbow","Coat of Plates"]
[null,2,21,"HobGoblin",5,3,"d6 / d4"," "," ",15,15,"3/4",1,"3/4","Boiled Leather",3,"Pierce","Morning Star"," - "," - ",21,14,5,2,2,3,-1,-1,2,1,2,null,null,null,33.823999999999998,0,null,1,14,null,"Battle-axe","Plate"]
[null,3,26,"BugBear",8,3,"d8 / d6"," "," ",16,14,"1/2","1/2","1/2","Scale (Iron)",3,"Pierce","Morning Star"," - "," - ",26,16,7,3,3,4,2,-1,1,2,1,null,null,null,64.355199999999996,0,null,9,30,null,"Battle-axe 2 hands","Hide"]
[null,3,20,"Orc",6,3,"d8 / d6"," "," ",12,15,"1/2","1/2","1/2","Scale (Iron)",3,"Chop","Falchion"," - "," - ",20,14,6,2,3,3,-2,-1,1,-1,-1,null,null,null,44.351999999999997,0,null,2,16,null,"Hand Axe","Thick Hide"]
[null,3,20,"Orc - Archer",2,2,"d6 / d4"," "," ",13,15,"1/2","1/2","1/2","Scale (Iron)",3,"Pierce","Crossbow"," - "," - ",20,14,6,2,3,2,-1,-1,1,-1,-1,null,null,null,28.224,0,null,3,18,null,"War Hammer","Scales"]
[null,4,36,"Uruk-Hai",10,4,"2d12 + d4"," "," ",14,11,"1/4","1/3","1/2","Coat of Plates",0,"Slash","Great Sword"," - "," - ",36,18,7,4,4,5,0,0,2,-1,0,null,null,null,151.524,0,null,4,20,null,"Club","Armoured scales"]
[null,3,20,"Gnoll",6,3,"d8 / d6"," "," ",13,15,"1/2","1/2","1/2","Scale (Iron)",3,"Slash","Battle-axe"," - "," - ",20,14,6,2,3,3,-1,0,1,0,0,null,null,null,44.351999999999997,0,null,5,22,null,"Mace","Stone scales"]
[null,4,21,"Gnoll leader",10,3,"2d12 + d4"," "," ",13,11,"1/4","1/2","3/4","Mail",0,"Slash","Battle-axe 2 hands"," - "," - ",21,16,7,2,5,4,-1,0,1,0,0,null,null,null,83.558999999999997,{"$f":"AH19*AI19*VLOOKUP(AH19,Attackers,2,TRUE)","v":0},null,6,24,null,"Morning Star","Dragon Scales"]
[null,4,54,"Ogre",13,2,"d10 / d8"," "," ",15,9,"3/4","3/4","3/4","Hide",0,"Bludgeon","Club"," - "," - ",54,26,9,5,3,7,-2,-1,4,-2,-1,null,null,null,142.88399999999999,{"$f":"AH20*AI20*VLOOKUP(AH20,Attackers,2,TRUE)","v":0},null,8,28,null,"Morning Star-Flail","Bone"]
[null,7,120,"Hill Giant",12,6,"d12 / d10"," "," ",15,8,"1/2","1/2","1/2","Hide",0,"Bludgeon","Club"," - "," - ",120,38,15,12,2,13,-2,0,4,-3,-2,null,null,null,279.88799999999998,0,null,10,32,null,"Spear"]
[null,8,138,"Stone Giant",11,6,"2d12+d2"," "," ",13,7,"1/5","1/4","1/3","Thick Hide",0,"Bludgeon","Club"," - "," - ",138,40,16,14,2,15,-1,0,4,-5,-1,null,null,null,352.39679999999998,0,null,null,null,null,"Spear 2 hands"]
[null,8,129,"Frost Giant",10,7,"2d12 + d8/d4"," "," ",17,6,"1/3","1/3","1/3","Hide",0,"Pierce","Morning Star"," - "," - ",129,48,21,14,2,18,0,0,3,-3,-1,null,null,null,303.40800000000002,0,null,null,null,null,"Dagger"]
[null,9,163,"Fire Giant",11,12,"2d12 + d10 / d8"," "," ",19,7,"1/4","1/4","1/4","Scale (Iron)",0,"Slash","Great Sword"," - "," - ",163,46,18,15,2,21,0,0,5,-4,-1,null,null,null,613.40160000000003,0,null,null,null,null,"Cutlass"]
["2nd hit at -1",7,80,"Ettin",13,3,"2d12 + d4",8," ",21,8,"1/2","1/2","1/2","Hide",0,"Pierce","Morning Star","Morning Star"," - ",80,28,12,10,3,10,-1,0,2,-4,4,null,null,null,239.90400000000002,0,null,null,null,null,"Falchion"]
[null,6,87,"Troll",5,3,"d10 / d8"," "," ",17,9,"1/4","1/3","1/2","Thick Hide",0,"Bludgeon","Thump"," - "," - ",87,34,11,7,4,8,-2,0,6,-2,1,null,null,null,148.77000000000001,0,null,null,null,null,"Short sword"]
[null,1,13,"Svart",2,0,"2d4"," "," ",13,14,1,1.5,1.5,"Leather",2,"Pierce","Short sword"," - "," - ",13,12,5,1,1,0,0,1,1,2,0,null,null,null,12.467000000000001,0,null,null,null,null,"Scimitar"]
[null,3,22,"Svart - leader",4,2,"d8 / d6"," "," ",16,15,1,1,1,"Padded",3,"Slash","Arming Sword"," - "," - ",22,16,6,2,3,2,1,1,2,1,0,null,null,null,34.214400000000005,0,null,null,null,null,"Falchion"]
[null,2,13,"Dark Creeper",4,0,"2d4"," "," ",12,14,"3/4",1,"3/4","Boiled Leather",2,"Pierce","Dagger"," - "," - ",13,11,4.5,1,2,0,1,0,1,2,0,null,null,null,17.667000000000002,0,null,null,null,null,"Arming Sword"]
[null,3,25,"Dark Stalker",5,2,"d8 / d4"," "," ",16,15,1,1,1,"Padded",3,"Pierce","Short sword"," - "," - ",25,14,6,3,3,2,1,1,1,2,0,null,null,null,40.799999999999997,0,null,null,null,null,"Bastard Sword"]
[null,7,55,"Shadow Knight",11,4,"2d12+d2"," "," ",22,15,"1/4","1/3","1/2","Coat of Plates",4,"Slash","Arming Sword"," - "," - ",55,17,6.5,7,7,5,-1,0,2,1,0,null,null,null,236.19200000000001,0,null,null,null,null,"Great Sword"]
[null,2,22,"Shade",3,2,"d8 / d4"," "," ",12,12,1,1,1,"Padded",0,"Slash","Arming Sword"," - "," - ",22,16,6,2,2,2,0,1,2,1,0,null,null,null,28.723200000000002,0,null,null,null,null,"Staff"]
[null,3,22,"Shadow",5,3,"d4"," "," ",13,12,1,1.5,1.5,"Leather",0,"Slash","Claw"," - "," - ",22,12,6,3,2,3,-1,-1,0,3,0,null,null,null,28.130666666666663,0,null,null,null,null,"Missile"]
[null,7,56,"Shadow Demon",14,12,"2d12 + d8/d4"," "," ",27,10,"3/4","3/4","1/2","Scale (Leather)",0,"Slash","Bastard Sword"," - "," - ",56,{"$f":"2*(W33+AC33)","v":20},8,7,7,15,2,1,2,2,2,null,null,null,248.55040000000002,0]
[null,28,633,"Shadow Dragon",7,7,"2d12 + d8 / d6"," "," ",27,6,"1/3","1/3","1/4","Scale (Leather)",0,"Slash","Claw"," - "," - ",633,124,55,50,5,18,6,8,7,2,5,null,null,null,1256.8848,0]
[null,2,14,"Lizardman",5,4,"d6 / d4"," "," ",20,14,1,1.5,1.5,"Leather",2,{"$f":"VLOOKUP(R35,weapons,2, FALSE)","v":"Pierce"},"Spear"," - "," - ",14,{"$f":"2*(W35+AC35)","v":14},6,1,3,4,1,0,1,2,1,null,null,null,20.458666666666666,0]
[null,2,11,"Green Gremlins",3,1,"d3",-2,-2,15,17,1,1.5,1.5,"Leather",3,{"$f":"VLOOKUP(R36,weapons,2, FALSE)","v":"Slash"},"Claw","Claw","Bite",11,{"$f":"2*(W36+AC36)","v":8},3,1,3,-1,0,0,1,2,2,null,null,null,12.055999999999999,{"$f":"(5+F37)*(10+IF(AG37>0,L37,K37))*((10+G37+H37))*V37*(5+O37)/1000*VLOOKUP(AH37,Specials,3,FALSE)+VLOOKUP(AH37,Specials,2,FALSE)","v":{"$error":"#VALUE!"}}]
[null,8,132,"Golem - Stone",3,15,"d12 / d10"," "," ",22,8,"1/10","1/10","1/5","Stone scales",0,{"$f":"VLOOKUP(R37,weapons,2, FALSE)","v":"Bludgeon"},"Thump"," - "," - ",132,{"$f":"2*(W37+AC37)","v":40},15,12,3,22,-4,-4,5,-2,-2,null,null,null,208.94719999999998]
[null,{"$f":"VLOOKUP(X38,Save,2,FALSE)","v":3},37,"Slumper",8,-1,"d10 / d6"," "," ",10,10,"1/4","1/3","1/2","Thick Hide",null,{"$f":"VLOOKUP(R38,weapons,2, FALSE)","v":"Bludgeon"},"Club"," - "," - ",37,{"$f":"2*(W38+AC38)","v":20},8,4,4,2,-2,-2,2,0,-2]

{"sheet":"Characters","index":3,"n_rows":38,"n_cols":43,"rows_kept":38,"cut":false,"hidden":false,"merged":[[0,14,0,15],[0,20,0,21],[0,0,1,0],[0,1,1,1],[0,2,1,2],[0,6,0,8],[0,9,0,10]]}
["Special","Save","Stamina Points",null,"Atk","Dmg \nbonus","Damage \nLevel",null,null,"Defence",null,"Absorb",null,null,"Armour",null,"Attack","Attack","Attack 2",null,"Health",null,"Size",null,null,null,null,"Attributes",null,null,null,"Flying","Ability"]
[null,null,null,null,null,null,"Dmg","Dmg","Dmg","Parry","Range","Cut","Thrust","Chop","Body","Shield","Type","Weapon",null,null,"SP","WP","feet","HD","Skill","Str","Int","Will","Con","Dex","Alert","Class",null,null,"Exp","total",null,null,null,null,"Weapon","Body Armour","Breast Plate"]
[null,null,null,null,null,null,null,null,null,null,null,null,null,null,null,null,null,null,null,null,null,null,null,null,null,null,null,null,null,null,null,null,null,null,null,null,null,null,null,null," - "," - ","-"]
["Fig / mage PP=10",{"$f":"ROUNDUP((X4+Y4)/2,0)","v":3},{"$f":"U4","v":24},"Falrik",{"$f":"Y4+ROUNDUP(AF4/2,0)+INT(+VLOOKUP(R4,weapons,3,FALSE)*MIN(Z4,8)+VLOOKUP(R4,weapons,4,FALSE)*(AD4))+VLOOKUP(W4,size,4)","v":5},{"$f":"Z4-VLOOKUP($W4,size,3)","v":2},{"$f":"VLOOKUP(VLOOKUP(R4,weapons,6,FALSE)+VLOOKUP($W4,size,3)+Y4-1,New_damage,2,FALSE)","v":"d8 / d6"},{"$f":"IF(S4<>\" - \",VLOOKUP(S4,weapons,3,FALSE)+VLOOKUP($W4,size,3),\" \")","v":" "}," ",{"$f":"INT(VLOOKUP(O4,body_armour,5,FALSE)+Y4+AE4+P4+VLOOKUP(W4,size,6)+(Z4+AD4)/2+VLOOKUP(R4,weapons,5,FALSE)/2 )","v":15},{"$f":"12+P4+VLOOKUP(W4,size,5)+AF4*3","v":14},{"$f":"VLOOKUP(VLOOKUP($O4,body_armour,2,FALSE)+IF($W4>6,INT(VLOOKUP($W4,size,7)),0),Armour_translation,2,FALSE)","v":"1/4"},{"$f":"VLOOKUP(VLOOKUP($O4,body_armour,3,FALSE)+IF($W4>6,INT(VLOOKUP($W4,size,7)),0),Armour_translation,2,FALSE)","v":"1/2"},{"$f":"VLOOKUP(VLOOKUP($O4,body_armour,4,FALSE)+IF($W4>6,INT(VLOOKUP($W4,size,7)),0),Armour_translation,2,FALSE)","v":"3/4"},"Mail Hauberk",2,{"$f":"VLOOKUP(R4,weapons,2, FALSE)","v":"Slash"},"Arming Sword"," - "," - ",{"$f":"INT(W4+X4*(4.5+AC4))+3","v":24},{"$f":"2*(W4+AC4)","v":12},5,3,3,2,3,-1,1,3,1,null,null,null,{"$f":"(5+E4)*(10+IF(AF4>0,M4,L4))*((10+F4+I4))*U4*(5+N4)/1000*VLOOKUP(AG4,Specials,3,FALSE)+VLOOKUP(AG4,Specials,2,FALSE)","v":{"$error":"#VALUE!"}},{"$f":"AH4*AI4*VLOOKUP(AH4,Attackers,2,TRUE)","v":{"$error":"#VALUE!"}},null,7,26,null,"Claw","Leather","Leather"]
["Priest PP=7",1,{"$f":"U5","v":18},"Gladariaa",1,0,"d4"," "," ",9,12,1,1,"3/4","Scale (Leather)",0,"Bludgeon","Staff"," - "," - ",{"$f":"INT(W5+X5*(4.5+AC5))+3","v":18},12,6,2,0,0,1,1,0,1,1,null,null,null,{"$error":"#VALUE!"},{"$error":"#VALUE!"},null,-3,4,null,"Thump","Padded","Metal"]
["Priest PP=4",1,13,"Finbal",1,1,"d8 / d4"," "," ",10,13,"3/4",1,"3/4","Boiled Leather",1,"Slash","Scimitar"," - "," - ",13,12,6,1,1,1,-1,1,0,0,0,null,null,null,{"$error":"#VALUE!"},{"$error":"#VALUE!"},null,-2,6,null,"Bite","Scale (Leather)"]
["Fighter",2,20,"Vorgus",3,2,"d10 / d6"," "," ",11,13,"1/4","1/2","3/4","Mail Hauberk",1,"Slash","Bastard Sword"," - "," - ",20,14,6,2,2,2,-1,-1,1,0,0,null,null,null,{"$error":"#VALUE!"},{"$error":"#VALUE!"},null,-3,4,null,"Cleaver","Boiled Leather"]
["Fighter",1,13,"Losogon",1,1,"d6 / d4"," "," ",14,15,1,1,1,"Padded",3,"Slash","Arming Sword"," - "," - ",13,12,6,1,1,1,-1,1,0,0,1,null,null,null,{"$error":"#VALUE!"},{"$error":"#VALUE!"},null,-3,4,null,"Bow - Short","Scale (Iron)"]
["Fighter",1,14,"Anabat",2,1,"d10 / d8"," "," ",11,12,1,1,1,"Padded",0,"Slash","Great Sword"," - "," - ",14,14,6,1,1,1,0,0,1,1,0,null,null,null,{"$error":"#VALUE!"},{"$error":"#VALUE!"},null,-3,4,null,"Bow - Long","Mail Hauberk"]
["Fighter",1,14,"Rish",2,2,"d6 / d4"," "," ",11,13,1,1,1,"Padded",1,"Slash","Arming Sword"," - "," - ",14,14,6,1,1,2,2,-1,1,0,-1,null,null,null,{"$error":"#VALUE!"},{"$error":"#VALUE!"},null,-1,8,null,"Crossbow","Mail"]
["Thief",4,19,"Venerman",4,1,"d8 / d4"," "," ",13,14,"3/4",1,"3/4","Boiled Leather",2,"Bludgeon","Mace"," - "," - ",19,8,6,4,3,1,-2,1,-2,2,1,null,null,null,{"$error":"#VALUE!"},{"$error":"#VALUE!"},null,0,11,null,"Battle-axe","Coat of Plates"]
["Thief",2,20,"Luge",0,-2,"d6 / d4"," "," ",10,14,"3/4",1,"3/4","Boiled Leather",2,"Slash","Arming Sword"," - "," - ",20,14,6,2,1,-2,0,-1,1,0,0,null,null,null,{"$error":"#VALUE!"},{"$error":"#VALUE!"},null,1,14,null,"Battle-axe 2 hands","Plate"]
["Thief",3,25,"Argun",3,2,"d8 / d4"," "," ",14,15,"3/4",1,"3/4","Boiled Leather",3,"Slash","Arming Sword"," - "," - ",25,14,6,3,2,2,-1,0,1,1,0,null,null,null,{"$error":"#VALUE!"},{"$error":"#VALUE!"},null,9,30,null,"Hand Axe","Hide"]
["Thief",2,22,"Pipluk",1,0,"d6 / d4"," "," ",13,14,"3/4",1,"3/4","Boiled Leather",2,"Slash","Arming Sword"," - "," - ",22,12,6,3,1,0,1,0,0,0,2,null,null,null,{"$error":"#VALUE!"},{"$error":"#VALUE!"},null,2,16,null,"War Hammer","Thick Hide"]
[null,1,13,"Cack-hand",1,-2,"d4"," "," ",9,12,1,1.5,1.5,"Leather",null,"Pierce","Dagger"," - "," - ",13,12,6,1,1,-2,-1,0,0,0,0,null,null,null,{"$error":"#VALUE!"},{"$error":"#VALUE!"},null,3,18,null,"Club","Scales"]
["Mage PP=5",1,11,"M'Dok",1,0,"2d4"," "," ",11,14,1,1.5,1.5,"Scales",0,"Pierce","Spear 2 hands"," - "," - ",11,8,3,1,1,-2,1,0,1,2,0,null,"Mage 1",null,{"$error":"#VALUE!"},{"$error":"#VALUE!"},null,4,20,null,"Mace","Armoured scales"]
["Priest PP=10",3,20,"Jakk",4,1,"d10 / d6"," "," ",14,15,"1/4","1/2","3/4","Mail Hauberk",3,"Slash","Arming Sword"," - "," - ",20,{"$f":"2*(W17+AC17)","v":14},6,2,4,1,-1,3,1,-1,0,null,"Priest 2",null,{"$error":"#VALUE!"},{"$error":"#VALUE!"},null,5,22,null,"Morning Star","Stone scales"]
["Fighter",2,24,"Vivlok",3,1,"d12 / d10"," "," ",10,12,"1/4","1/2","3/4","Mail Hauberk",0,"Slash","Great Sword"," - "," - ",24,18,6,2,2,1,0,-1,3,0,0,null,null,null,{"$error":"#VALUE!"},{"$error":"#VALUE!"},null,6,24,null,"Morning Star-Flail","Dragon Scales"]
["Fighter",1,14,"Trob",1,0,"d6 / d4"," "," ",12,15,"3/4",1,"3/4","Boiled Leather",3,"Slash","Arming Sword"," - "," - ",14,14,6,1,1,0,-1,0,1,1,0,null,null,null,{"$error":"#VALUE!"},{"$error":"#VALUE!"},null,8,28,null,"Spear","Bone"]
["Mage PP=12",2,18,"Dark Odo",2,0,"2d4",{"$f":"IF(S20<>\" - \",VLOOKUP(S20,weapons,3,FALSE)+VLOOKUP($W20,size,3),\" \")","v":" "}," ",11,12,1,1.5,1.5,"Leather",0,"Bludgeon","Staff"," - "," - ",18,12,6,2,1,0,2,0,0,1,0,null,"Mage 2",null,{"$error":"#VALUE!"},{"$error":"#VALUE!"},null,10,32,null,"Spear 2 hands"]
["Cleric PP=7",3,22,"Mudras",3,1,"d6 / d4"," "," ",10,14,"3/4",1,"3/4","Boiled Leather",2,"Bludgeon","Mace"," - "," - ",22,{"$f":"2*(W21+AC21)","v":12},6,3,2,1,-1,3,0,0,0,null,"Priest 1",null,{"$error":"#VALUE!"},{"$error":"#VALUE!"},null,null,null,null,"Dagger"]
[null,3,19,"Runas",4,2,"d6 / d4"," "," ",12,15,"1/4","1/2","3/4","Mail Hauberk",3,"Pierce","Morning Star"," - "," - ",19,10,6,3,2,2,0,0,-1,0,1,null,null,null,{"$error":"#VALUE!"},{"$error":"#VALUE!"},null,null,null,null,"Cutlass"]
[null,4,23,"Erig",4,0,"d10 / d6"," "," ",16,15,"3/4",1,"3/4","Boiled Leather",3,"Slash","Arming Sword"," - "," - ",23,10,6,4,4,0,2,1,-1,1,1,null,null,null,{"$error":"#VALUE!"},{"$error":"#VALUE!"},null,null,null,null,"Falchion"]
[null,2,20,"Orwen",2,1,"2d4"," "," ",13,15,"3/4",1,"3/4","Boiled Leather",3,"Pierce","Short sword"," - "," - ",20,14,6,2,1,1,-1,-1,1,1,1,null,null,null,{"$error":"#VALUE!"},{"$error":"#VALUE!"},null,null,null,null,"Short sword"]
[null,3,25,"Jessop",3,2,"d8 / d6"," "," ",15,15,1,1,"3/4","Scale (Leather)",3,"Slash","Arming Sword"," - "," - ",25,14,6,3,3,2,0,-1,1,-1,1,null,null,null,{"$error":"#VALUE!"},{"$error":"#VALUE!"},null,null,null,null,"Scimitar"]
[null,3,25,"Tuxarra",4,2,"d8 / d6"," "," ",16,15,1,1,"3/4","Scale (Leather)",3,"Slash","Arming Sword"," - "," - ",25,14,6,3,3,2,-1,-1,1,0,1,null,null,null,{"$error":"#VALUE!"},{"$error":"#VALUE!"},null,null,null,null,"Arming Sword"]
["Priest PP=10",3,25,"Diker Thane",2,0,"d6 / d4"," "," ",10,15,"1/2","1/2","1/2","Scale (Iron)",3,"Bludgeon","Mace"," - "," - ",25,14,6,3,2,0,1,2,1,0,0,null,"Priest 3",null,{"$error":"#VALUE!"},{"$error":"#VALUE!"},null,null,null,null,"Bastard Sword"]
["Necro PP=10",2,18,"Sega Thane",3,1,"d12 / d10"," "," ",13,15,"1/4","1/3","1/2","Coat of Plates",3,"Slash","Great Sword"," - "," - ",18,12,6,2,2,1,2,1,0,0,0,null,"Priest 3",null,{"$error":"#VALUE!"},{"$error":"#VALUE!"},null,null,null,null,"Great Sword"]
[null,3,22," ",2,0,"d8 / d4"," "," ",13,15,"3/4",1,"3/4","Boiled Leather",3,"Slash","Arming Sword"," - "," - ",22,12,6,3,2,0,0,0,0,0,0,null,null,null,{"$error":"#VALUE!"},{"$error":"#VALUE!"},null,null,null,null,"Staff"]
[null,2,14,"Diker's men",3,1,"d6 / d4"," "," ",11,15,1,1,"3/4","Scale (Leather)",3,"Bludgeon","Mace"," - "," - ",14,14,6,1,2,1,0,0,1,0,0,null,null,null,{"$error":"#VALUE!"},{"$error":"#VALUE!"},null,null,null,null,"Missile"]
[null,4,28,"Diker's 2IC",6,2,"d8 / d6"," "," ",14,15,"1/4","1/2","3/4","Mail Hauberk",3,"Bludgeon","Mace"," - "," - ",28,{"$f":"2*(W31+AC31)","v":16},6,3,4,2,-2,-1,2,1,1,null,null,null,{"$error":"#VALUE!"},{"$error":"#VALUE!"}]
["Necro",{"$f":"ROUNDUP((X32+Y32)/2,0)","v":2},18,"Svlad",2,-2,"d4",{"$error":"#N/A"},{"$error":"#N/A"},11,12,1,1.5,1.5,"Leather",null,{"$f":"VLOOKUP(R32,weapons,2, FALSE)","v":"Pierce"},"Dagger",null,null,18,20,6,2,1,-2,3,0,0,1,2,null,"Priest 3",null,{"$error":"#N/A"},{"$error":"#N/A"}]
["Necro PP=12",{"$f":"VLOOKUP(X33,Save,2,FALSE)","v":3},27,"Torak",4,1,"d8 / d4"," "," ",13,14,"1/4","1/3","1/2","Coat of Plates",2,"Bludgeon","Mace"," - "," - ",{"$f":"INT(W33+X33*(4.5+AC33))+3","v":27},{"$f":"2*(W33+AC33)","v":12},6,4,3,1,2,2,0,1,2,null,"Priest 4",null,{"$error":"#VALUE!"},{"$error":"#VALUE!"}]
[null,{"$f":"VLOOKUP(X34,Save,2,FALSE)","v":2},{"$f":"U34","v":22},"Snablet",1,-1,"d4"," "," ",11,12,1,1.5,1.5,"Leather",0,"Bludgeon","Club"," - "," - ",{"$f":"INT(W34+X34*(4.5+AC34))+3","v":22},{"$f":"2*(W34+AC34)","v":12},6,3,2,-1,2,1,0,1,2,null,"Mage 2",null,{"$error":"#VALUE!"},{"$error":"#VALUE!"}]
[null,{"$f":"VLOOKUP(X35,Save,2,FALSE)","v":3},{"$f":"U35","v":23},"Punketah",1,-1,"d4"," "," ",10,12,1,1,"3/4","Scale (Leather)",0,"Bludgeon","Club"," - "," - ",{"$f":"INT(W35+X35*(4.5+AC35))+3","v":23},{"$f":"2*(W35+AC35)","v":10},6,4,2,-1,3,0,-1,2,2,null,"Mage 3",null,{"$error":"#VALUE!"},{"$error":"#VALUE!"}]
["Mage PP=7",{"$f":"VLOOKUP(X36,Save,2,FALSE)","v":2},{"$f":"U36","v":19},"Belreeve",3,-1,"2d4"," "," ",13,12,2,2,2," - ",0,"Bludgeon","Staff"," - "," - ",{"$f":"INT(W36+X36*(4.5+AC36))+3","v":19},{"$f":"2*(W36+AC36)","v":10},6,3,1,-1,2,1,-1,2,1,null,"Mage 2",null,{"$error":"#VALUE!"}]
[null,null,null,"Ned",{"$f":"Y37+ROUNDUP(AF37/2,0)+INT(+VLOOKUP(R37,weapons,3,FALSE)*MIN(Z37,8)+VLOOKUP(R37,weapons,4,FALSE)*(AD37))+VLOOKUP(W37,size,4)","v":2},{"$f":"Z37-VLOOKUP($W37,size,3)","v":0},{"$f":"VLOOKUP(VLOOKUP(R37,weapons,6,FALSE)+VLOOKUP($W37,size,3)+Y37-1,New_damage,2,FALSE)","v":"d4"},{"$f":"IF(S37<>\" - \",VLOOKUP(S37,weapons,3,FALSE)+VLOOKUP($W37,size,3),\" \")","v":" "},{"$f":"IF(T37<>\" - \",VLOOKUP(T37,weapons,3,FALSE)+VLOOKUP($W37,size,3),\" \")","v":" "},{"$f":"INT(VLOOKUP(O37,body_armour,5,FALSE)+Y37+AE37+P37+VLOOKUP(W37,size,6)+(Z37+AD37)/2+VLOOKUP(R37,weapons,5,FALSE)/2 )","v":13},{"$f":"12+P37+VLOOKUP(W37,size,5)+AF37*3","v":12},2,2,2," - ",0,"Bludgeon","Club"," - "," - ",{"$f":"INT(W37+X37*(4.5+AC37))+3","v":25},{"$f":"2*(W37+AC37)","v":14},6,3,2,0,-1,0,1,2,2]
[null,null,null,null,{"$error":"#N/A"},4,{"$error":"#N/A"},{"$error":"#N/A"},{"$error":"#N/A"},{"$error":"#N/A"},17,{"$error":"#N/A"},{"$error":"#N/A"},{"$error":"#N/A"}]

{"sheet":"Undead","index":4,"n_rows":38,"n_cols":43,"rows_kept":38,"cut":false,"hidden":false,"merged":[[0,20,0,21],[0,14,0,15],[0,6,0,8],[0,0,1,0],[0,1,1,1],[0,2,1,2],[0,9,0,10]]}
["Special","Save","Stamina Points",null,"Atk","Dmg \nbonus","Damage \nLevel",null,null,"Defence",null,"Absorb",null,null,"Armour",null,"Attack","Attack","Attack 2","Attack 3","Health",null,"Size",null,null,null,null,"Attributes",null,null,null,"Flying","Ability"]
[null,null,null,null,null,null,"Dmg","Dmg","Dmg","Parry","Range","Cut","Thrust","Chop","Body","Shield","Type","Weapon","Weapon","Weapon","SP","WP","feet","HD","Skill","Str","Int","Will","Con","Dex","Alert","Class",null,null,"Exp","total",null,"Attributes",null,null,"Weapon","Body Armour","Breast Plate"]
[null,null,null,null,null,null,null,null,null,null,null,null,null,null,null,null,null,null,null,null,null,null,null,null,null,null,null,null,null,null,null,null,null,null,null,null,null,"New","Old",null," - "," - ","-"]
[null,{"$f":"ROUNDUP((X4+Y4)/2,0)","v":2},{"$f":"U4","v":14},"Skeleton",{"$f":"Y4+ROUNDUP(AF4/2,0)+INT(+VLOOKUP(R4,weapons,3,FALSE)*MIN(Z4,8)+VLOOKUP(R4,weapons,4,FALSE)*(AD4))+VLOOKUP(W4,size,4)","v":3},{"$f":"Z4-VLOOKUP($W4,size,3)","v":0},{"$f":"VLOOKUP(VLOOKUP(R4,weapons,6,FALSE)+VLOOKUP($W4,size,3)+Y4-1,New_damage,2,FALSE)","v":"2d4"},{"$f":"IF(S4<>\" - \",VLOOKUP(S4,weapons,3,FALSE)+VLOOKUP($W4,size,3),\" \")","v":" "}," ",{"$f":"INT(VLOOKUP(O4,body_armour,5,FALSE)+Y4+AE4+P4+VLOOKUP(W4,size,6)+(Z4+AD4)/2+VLOOKUP(R4,weapons,5,FALSE)/2 )","v":15},{"$f":"12+P4+VLOOKUP(W4,size,5)+AF4*3","v":14},{"$f":"VLOOKUP(VLOOKUP($O4,body_armour,2,FALSE)+IF($W4>6,INT(VLOOKUP($W4,size,7)),0),Armour_translation,2,FALSE)","v":2},{"$f":"VLOOKUP(VLOOKUP($O4,body_armour,3,FALSE)+IF($W4>6,INT(VLOOKUP($W4,size,7)),0),Armour_translation,2,FALSE)","v":2},{"$f":"VLOOKUP(VLOOKUP($O4,body_armour,4,FALSE)+IF($W4>6,INT(VLOOKUP($W4,size,7)),0),Armour_translation,2,FALSE)","v":2}," - ",2,{"$f":"VLOOKUP(R4,weapons,2, FALSE)","v":"Chop"},"Cleaver"," - "," - ",{"$f":"INT(W4+X4*(4.5+AC4))+3","v":14},{"$f":"2*(W4+AC4)","v":14},6,1,2,0,{"$f":"--2","v":2},0,1,2,0,null,null,null,{"$f":"(5+E4)*(10+IF(AF4>0,M4,L4))*((10+F4+G4))*U4*(5+N4)/1000*VLOOKUP(AG4,Specials,3,FALSE)+VLOOKUP(AG4,Specials,2,FALSE)","v":{"$error":"#VALUE!"}},{"$f":"AH4*AI4*VLOOKUP(AH4,Attackers,2,TRUE)","v":{"$error":"#VALUE!"}},null,-3,4,null,"Claw","Leather","Leather"]
[null,2,{"$f":"U5","v":14},"Skeleton - warrior",4,2,"d8 / d4"," "," ",13,14,"1/2","1/2","1/2","Scale (Iron)",2,{"$f":"VLOOKUP(R5,weapons,2, FALSE)","v":"Slash"},"Arming Sword"," - "," - ",{"$f":"INT(W5+X5*(4.5+AC5))+3","v":14},{"$f":"2*(W5+AC5)","v":14},6,1,2,2,{"$f":"--2","v":2},0,1,2,0,null,null,null,{"$error":"#VALUE!"},{"$error":"#VALUE!"},null,-3,4,null,"Claw","Leather","Leather"]
[null,2,22,"Zombie",0,2,"d4"," "," ",7,12,1,1,1,"Hide",0,"Chop","Cleaver"," - "," - ",{"$f":"INT(W6+X6*(4.5+AC6))+3","v":22},16,6,2,1,2,-3,-2,2,-3,-2,null,null,null,{"$error":"#VALUE!"},{"$error":"#VALUE!"},null,-2,6,null,"Thump","Padded","Metal"]
["Paralyse",3,20,"Ghoul",5,2,"d6 / d4",0,0,13,12,"3/4",1,"3/4","Boiled Leather",0,"Slash","Claw","Claw","Bite",20,14,6,2,4,2,-1,-1,1,1,1,null,"paralysis",null,{"$error":"#VALUE!"},{"$error":"#VALUE!"},null,-1,8,null,"Bite","Scale (Leather)"]
["Lose con/str",4,35,"Wight",5,2,"d6 / d4"," "," ",14,12,1,1,1,"Hide",0,"Slash","Claw"," - "," - ",35,16,6,4,4,2,0,0,2,1,0,null,null,null,{"$error":"#VALUE!"},{"$error":"#VALUE!"},null,0,11,null,"Hug","Boiled Leather"]
["Paralyse",3,35,"Ghast",2,2,"d4",0,0,11,12,1,1,1,"Hide",0,"Slash","Claw","Claw","Bite",35,16,6,4,2,2,1,0,2,0,0,null,"Paralysis",null,{"$error":"#VALUE!"},{"$error":"#VALUE!"},null,1,14,null,"Cleaver","Scale (Iron)"]
[null,5,31,"Swordwraith",7,2,"d10 / d8"," "," ",19,12,2,2,2," - ",0,"Slash","Arming Sword"," - "," - ",31,12,6,5,5,2,1,0,0,2,1,null,null,null,{"$error":"#VALUE!"},{"$error":"#VALUE!"},null,2,16,null,"Bow - Short","Mail Hauberk"]
["Rotting disease",5,55,"Mummy",3,3,"2d4",1," ",12,11,1,1,"3/4","Scale (Leather)",0,"Bludgeon","Thump","Thump"," - ",55,20,7,6,3,4,0,0,3,-1,0,null,"Disease",null,{"$error":"#VALUE!"},{"$error":"#VALUE!"},null,3,18,null,"Bow - Long","Mail"]
["Lose con/str",5,47,"Spectre",5,0,"2d4"," "," ",13,12,2,2,2," - ",0,"Slash","Claw"," - "," - ",47,14,6,7,3,0,1,0,1,2,0,null,null,null,{"$error":"#VALUE!"},{"$error":"#VALUE!"},null,4,20,null,"Crossbow","Coat of Plates"]
["Lose con/str",7,61,"Vampire",10,5,"d8 / d6"," "," ",23,12,2,2,2," - ",0,"Slash","Claw"," - "," - ",61,16,6,8,6,5,3,2,2,4,3,null,null,null,{"$error":"#VALUE!"},{"$error":"#VALUE!"},null,5,22,null,"Battle-axe","Plate"]
[null,8,64,"Ghost",7,0,"d8 / d4"," "," ",15,12,2,2,2," - ",0,"Slash","Claw"," - "," - ",64,14,6,10,5,0,0,0,1,2,0,null,null,null,{"$error":"#VALUE!"},{"$error":"#VALUE!"},null,6,24,null,"Battle-axe 2 hands","Hide"]
[null,2,19,"Zombie-kobold",-4,2,"2d4"," "," ",7,14,2,2,2," - ",0,"Pierce","Spear 2 hands"," - "," - ",19,{"$f":"2*(W15+AC15)","v":10},3,2,1,0,-2,-2,2,-3,-2,null,null,null,{"$error":"#VALUE!"},{"$error":"#VALUE!"},null,7,26,null,"Hand Axe","Thick Hide"]
["Paralyse",2,22,"Necrophidius",3,1,"2d4"," "," ",14,13,"1/4","1/10","1/2","Bone",1,"Pierce","Bite"," - "," - ",22,{"$f":"2*(W16+AC16)","v":16},6,2,2,1,-2,0,2,1,2,null,"Paralysis",null,{"$error":"#VALUE!"},{"$error":"#VALUE!"},null,8,28,null,"War Hammer","Scales"]
[null,2,16,"Skeleton Warhorse",3,-1,"d6 / d4",3,3,11,10,"1/5",{"$error":"#N/A"},"1/3","Bone",0,{"$f":"VLOOKUP(R17,weapons,2, FALSE)","v":"Bludgeon"},"Thump","Thump","Bite",{"$f":"INT(W17+X17*(4.5+AC17))+3","v":16},{"$f":"2*(W17+AC17)","v":18},8,1,2,2,-2,-3,1,-1,-2,null,null,null,{"$error":"#VALUE!"},{"$error":"#VALUE!"},null,9,30,null,"Club","Armoured scales"]
[null,2,22,"Coffer Corpse",2,-1,"2d4"," "," ",10,10,"1/5",{"$error":"#N/A"},"1/3","Bone",0,{"$f":"VLOOKUP(R18,weapons,2, FALSE)","v":"Bludgeon"},"Thump"," - "," - ",{"$f":"INT(W18+X18*(4.5+AC18))+3","v":22},{"$f":"2*(W18+AC18)","v":18},8,2,1,2,-2,-3,1,-1,-2,null,null,null,{"$error":"#VALUE!"},{"$error":"#VALUE!"},null,10,32,null,"Mace","Stone scales"]
[null,0,null,null,{"$error":"#N/A"},4,{"$error":"#N/A"},{"$error":"#N/A"},{"$error":"#N/A"},{"$error":"#N/A"},17,{"$error":"#N/A"},{"$error":"#N/A"},{"$error":"#N/A"},null,null,null,null,null,null,null,null,null,null,null,null,null,null,null,null,null,null,null,null,{"$error":"#N/A"},{"$error":"#N/A"},null,null,null,null,"Morning Star","Dragon Scales"]
[null,0,null,null,{"$error":"#N/A"},4,{"$error":"#N/A"},{"$f":"IF(S20<>\" - \",VLOOKUP(S20,weapons,3,FALSE)+VLOOKUP($W20,size,3),\" \")","v":{"$error":"#N/A"}},{"$error":"#N/A"},{"$error":"#N/A"},17,{"$error":"#N/A"},{"$error":"#N/A"},{"$error":"#N/A"},null,null,null,null,null,null,null,null,null,null,null,null,null,null,null,null,null,null,null,null,{"$error":"#N/A"},{"$error":"#N/A"},null,null,null,null,"Morning Star-Flail","Bone"]
[null,0,null,null,{"$error":"#N/A"},4,{"$error":"#N/A"},{"$error":"#N/A"},{"$error":"#N/A"},{"$error":"#N/A"},17,{"$error":"#N/A"},{"$error":"#N/A"},{"$error":"#N/A"},null,null,null,null,null,null,null,null,null,null,null,null,null,null,null,null,null,null,null,null,{"$error":"#N/A"},{"$error":"#N/A"},null,null,null,null,"Spear"]
[null,0,null,null,{"$error":"#N/A"},4,{"$error":"#N/A"},{"$error":"#N/A"},{"$error":"#N/A"},{"$error":"#N/A"},17,{"$error":"#N/A"},{"$error":"#N/A"},{"$error":"#N/A"},null,null,null,null,null,null,null,null,null,null,null,null,null,null,null,null,null,null,null,null,{"$error":"#N/A"},{"$error":"#N/A"},null,null,null,null,"Spear 2 hands"]
[null,0,null,null,{"$error":"#N/A"},4,{"$error":"#N/A"},{"$error":"#N/A"},{"$error":"#N/A"},{"$error":"#N/A"},17,{"$error":"#N/A"},{"$error":"#N/A"},{"$error":"#N/A"},null,null,null,null,null,null,null,null,null,null,null,null,null,null,null,null,null,null,null,null,{"$error":"#N/A"},{"$error":"#N/A"},null,null,null,null,"Dagger"]
[null,0,null,null,{"$error":"#N/A"},4,{"$error":"#N/A"},{"$error":"#N/A"},{"$error":"#N/A"},{"$error":"#N/A"},17,{"$error":"#N/A"},{"$error":"#N/A"},{"$error":"#N/A"},null,null,null,null,null,null,null,null,null,null,null,null,null,null,null,null,null,null,null,null,{"$error":"#N/A"},{"$error":"#N/A"},null,null,null,null,"Cutlass"]
[null,0,null,null,{"$error":"#N/A"},4,{"$error":"#N/A"},{"$error":"#N/A"},{"$error":"#N/A"},{"$error":"#N/A"},17,{"$error":"#N/A"},{"$error":"#N/A"},{"$error":"#N/A"},null,null,null,null,null,null,null,null,null,null,null,null,null,null,null,null,null,null,null,null,{"$error":"#N/A"},{"$error":"#N/A"},null,null,null,null,"Falchion"]
[null,0,null,null,{"$error":"#N/A"},4,{"$error":"#N/A"},{"$error":"#N/A"},{"$error":"#N/A"},{"$error":"#N/A"},17,{"$error":"#N/A"},{"$error":"#N/A"},{"$error":"#N/A"},null,null,null,null,null,null,null,null,null,null,null,null,null,null,null,null,null,null,null,null,{"$error":"#N/A"},{"$error":"#N/A"},null,null,null,null,"Short sword"]
[null,0,null,null,{"$error":"#N/A"},4,{"$error":"#N/A"},{"$error":"#N/A"},{"$error":"#N/A"},{"$error":"#N/A"},17,{"$error":"#N/A"},{"$error":"#N/A"},{"$error":"#N/A"},null,null,null,null,null,null,null,null,null,null,null,null,null,null,null,null,null,null,null,null,{"$error":"#N/A"},{"$error":"#N/A"},null,null,null,null,"Scimitar"]
[null,0,null,null,{"$error":"#N/A"},4,{"$error":"#N/A"},{"$error":"#N/A"},{"$error":"#N/A"},{"$error":"#N/A"},17,{"$error":"#N/A"},{"$error":"#N/A"},{"$error":"#N/A"},null,null,null,null,null,null,null,null,null,null,null,null,null,null,null,null,null,null,null,null,{"$error":"#N/A"},{"$error":"#N/A"},null,null,null,null,"Arming Sword"]
[null,0,null,null,{"$error":"#N/A"},4,{"$error":"#N/A"},{"$error":"#N/A"},{"$error":"#N/A"},{"$error":"#N/A"},17,{"$error":"#N/A"},{"$error":"#N/A"},{"$error":"#N/A"},null,null,null,null,null,null,null,null,null,null,null,null,null,null,null,null,null,null,null,null,{"$error":"#N/A"},{"$error":"#N/A"},null,null,null,null,"Bastard Sword"]
[null,0,null,null,{"$error":"#N/A"},4,{"$error":"#N/A"},{"$error":"#N/A"},{"$error":"#N/A"},{"$error":"#N/A"},17,{"$error":"#N/A"},{"$error":"#N/A"},{"$error":"#N/A"},null,null,null,null,null,null,null,null,null,null,null,null,null,null,null,null,null,null,null,null,{"$error":"#N/A"},{"$error":"#N/A"},null,null,null,null,"Great Sword"]
[null,0,null,null,{"$error":"#N/A"},4,{"$error":"#N/A"},{"$error":"#N/A"},{"$error":"#N/A"},{"$error":"#N/A"},17,{"$error":"#N/A"},{"$error":"#N/A"},{"$error":"#N/A"},null,null,null,null,null,null,null,null,null,null,null,null,null,null,null,null,null,null,null,null,{"$error":"#N/A"},{"$error":"#N/A"},null,null,null,null,"Staff"]
[null,{"$f":"ROUNDUP((X32+Y32)/2,0)","v":0},null,null,{"$error":"#N/A"},4,{"$error":"#N/A"},{"$error":"#N/A"},{"$error":"#N/A"},{"$error":"#N/A"},17,{"$error":"#N/A"},{"$error":"#N/A"},{"$error":"#N/A"},null,null,null,null,null,null,null,null,null,null,null,null,null,null,null,null,null,null,null,null,{"$error":"#N/A"},{"$error":"#N/A"},null,null,null,null,"Missile"]
[null,0,null,null,{"$error":"#N/A"},4,{"$error":"#N/A"},{"$error":"#N/A"},{"$error":"#N/A"},{"$error":"#N/A"},17,{"$error":"#N/A"},{"$error":"#N/A"},{"$error":"#N/A"},null,null,null,null,null,null,null,null,null,null,null,null,null,null,null,null,null,null,null,null,{"$error":"#N/A"},{"$error":"#N/A"}]
[null,0,null,null,{"$error":"#N/A"},4,{"$error":"#N/A"},{"$error":"#N/A"},{"$error":"#N/A"},{"$error":"#N/A"},17,{"$error":"#N/A"},{"$error":"#N/A"},{"$error":"#N/A"},null,null,null,null,null,null,null,null,null,null,null,null,null,null,null,null,null,null,null,null,{"$error":"#N/A"},{"$error":"#N/A"}]
[null,0,null,null,{"$error":"#N/A"},4,{"$error":"#N/A"},{"$error":"#N/A"},{"$error":"#N/A"},{"$error":"#N/A"},17,{"$error":"#N/A"},{"$error":"#N/A"},{"$error":"#N/A"},null,null,null,null,null,null,null,null,null,null,null,null,null,null,null,null,null,null,null,null,{"$error":"#N/A"},{"$error":"#N/A"}]
[null,0,null,null,{"$error":"#N/A"},4,{"$error":"#N/A"},{"$error":"#N/A"},{"$error":"#N/A"},{"$error":"#N/A"},17,{"$error":"#N/A"},{"$error":"#N/A"},{"$error":"#N/A"}]
[null,null,null,null,{"$error":"#N/A"},4,{"$error":"#N/A"},{"$error":"#N/A"},{"$error":"#N/A"},{"$error":"#N/A"},17,{"$error":"#N/A"},{"$error":"#N/A"},{"$error":"#N/A"}]
[null,null,null,null,{"$error":"#N/A"},4,{"$error":"#N/A"},{"$error":"#N/A"},{"$error":"#N/A"},{"$error":"#N/A"},17,{"$error":"#N/A"},{"$error":"#N/A"},{"$error":"#N/A"}]

{"sheet":"Animals","index":5,"n_rows":39,"n_cols":43,"rows_kept":39,"cut":false,"hidden":false,"merged":[[0,20,0,21],[0,14,0,15],[0,6,0,8],[0,0,1,0],[0,1,1,1],[0,2,1,2],[0,9,0,10]]}
["Special","Save","Stamina Points",null,"Atk","Dmg \nbonus","Damage \nLevel",null,null,"Defence",null,"Absorb",null,null,"Armour",null,"Attack","Attack",null,null,"Health",null,"Size",null,null,null,null,"Attributes",null,null,null,"Flying","Ability"]
[null,null,null,null,null,null,"Dmg","Dmg","Dmg","Parry","Range","Cut","Thrust","Chop","Body","Shield","Type","Weapon","Weapon","Weapon","SP","WP","feet","HD","Skill","Str","Int","Will","Con","Dex","Alert","Class",null,null,"Exp","total",null,"Attributes",null,null,"Weapon","Body Armour","Breast Plate"]
[null,null,null,null,null,null,null,null,null,null,null,null,null,null,null,null,null,null,null,null,null,null,null,null,null,null,null,null,null,null,null,null,null,null,null,null,null,"New","Old",null," - "," - ","-"]
[null,{"$f":"ROUNDUP((X4+Y4)/2,0)","v":2},{"$f":"U4","v":13},"Wolf",{"$f":"Y4+ROUNDUP(AF4/2,0)+INT(+VLOOKUP(R4,weapons,3,FALSE)*MIN(Z4,8)+VLOOKUP(R4,weapons,4,FALSE)*(AD4))+VLOOKUP(W4,size,4)","v":5},{"$f":"Z4-VLOOKUP($W4,size,3)","v":2},{"$f":"VLOOKUP(VLOOKUP(R4,weapons,6,FALSE)+VLOOKUP($W4,size,3)+Y4-1,New_damage,2,FALSE)","v":"d4"},{"$f":"IF(S4<>\" - \",VLOOKUP(S4,weapons,3,FALSE)+VLOOKUP($W4,size,3),\" \")","v":" "}," ",{"$f":"INT(VLOOKUP(O4,body_armour,5,FALSE)+Y4+AE4+P4+VLOOKUP(W4,size,6)+(Z4+AD4)/2+VLOOKUP(R4,weapons,5,FALSE)/2 )","v":15},{"$f":"12+P4+VLOOKUP(W4,size,5)+AF4*3","v":13},{"$f":"VLOOKUP(VLOOKUP($O4,body_armour,2,FALSE)+IF($W4>6,INT(VLOOKUP($W4,size,7)),0),Armour_translation,2,FALSE)","v":2},{"$f":"VLOOKUP(VLOOKUP($O4,body_armour,3,FALSE)+IF($W4>6,INT(VLOOKUP($W4,size,7)),0),Armour_translation,2,FALSE)","v":2},{"$f":"VLOOKUP(VLOOKUP($O4,body_armour,4,FALSE)+IF($W4>6,INT(VLOOKUP($W4,size,7)),0),Armour_translation,2,FALSE)","v":2}," - ",0,{"$f":"VLOOKUP(R4,weapons,2, FALSE)","v":"Pierce"},"Bite"," - "," - ",{"$f":"INT(W4+X4*(4.5+AC4))-2","v":13},{"$f":"2*(W4+AC4)","v":10},4,2,2,1,-3,-1,1,4,3,null,null,null,{"$f":"(5+E4)*(10+IF(AF4>0,M4,J4))*((10+F4+G4))*U4*(5+N4)/1000*VLOOKUP(AG4,Specials,3,FALSE)+VLOOKUP(AG4,Specials,2,FALSE)","v":{"$error":"#VALUE!"}},{"$f":"AH4*AI4*VLOOKUP(AH4,Attackers,2,TRUE)","v":{"$error":"#VALUE!"}},null,-3,4,null,"Claw","Leather","Leather"]
[null,3,19,"Worg",5,3,"d6 / d4"," "," ",16,12,2,2,2," - ",0,"Pierce","Bite"," - "," - ",19,12,5,3,3,3,-2,-1,1,2,2,null,null,null,{"$error":"#VALUE!"},{"$error":"#VALUE!"},null,-2,6,null,"Thump","Padded","Metal"]
[null,3,28,"Dire Wolf",4,1,"d8 / d6"," "," ",17,10,1.5,1.5,1.5," - ",0,"Pierce","Bite"," - "," - ",28,18,8,4,2,4,-3,-1,1,0,2,null,null,null,{"$error":"#VALUE!"},{"$error":"#VALUE!"},null,-1,8,null,"Bite","Scale (Leather)"]
["frost breath",4,38,"Winter Wolf",6,0,"d6 / d4"," "," ",17,11,2,2,2," - ",0,"Pierce","Bite"," - "," - ",38,16,7,6,2,1,0,0,1,3,3,null,null,null,{"$error":"#VALUE!"},{"$error":"#VALUE!"},null,0,11,null,"Hug","Boiled Leather"]
[null,3,27,"Giant Lizard",0,4,"2d4"," "," ",10,11,1,1,1,"Hide",0,"Pierce","Bite"," - "," - ",27,16,7,4,1,5,-5,-3,1,-2,-1,null,null,null,{"$error":"#VALUE!"},{"$error":"#VALUE!"},null,1,14,null,"Cleaver","Scale (Iron)"]
[null,2,9,"Giant Black Ants",2,3,"d3"," "," ",11,15,1,1.5,1.5,"Scales",0,"Pierce","Bite"," - "," - ",{"$f":"INT(W9+X9*(4.5+AC9))-2","v":9},{"$f":"2*(W9+AC9)","v":4},2,2,2,1,-2,-1,0,1,0,null,"Poison",null,{"$error":"#VALUE!"},{"$error":"#VALUE!"},null,2,16,null,"Bow - Short","Mail Hauberk"]
[" + Acid L1",2,10,"Giant Red Ants",2,4,"d3"," "," ",10,14,"1/4","1/4","1/4","Armoured scales",0,{"$f":"VLOOKUP(R10,weapons,2, FALSE)","v":"Pierce"},"Bite"," - "," - ",{"$f":"INT(W10+X10*(4.5+AC10))-2","v":10},{"$f":"2*(W10+AC10)","v":6},3,2,2,2,-2,-1,0,2,0,null,"Poison",null,{"$error":"#VALUE!"},{"$error":"#VALUE!"},null,2,16,null,"Bow - Short","Mail Hauberk"]
[null,1,4,"Giant Bats",5,2,"d2"," "," ",12,27,1,1.5,1.5,"Leather",0,"Pierce","Bite"," - "," - ",4,4,2,1,1,0,-2,-2,0,3,3,4,null,null,{"$error":"#VALUE!"},{"$error":"#VALUE!"},null,3,18,null,"Bow - Long","Mail"]
["disease DC 7",1,6,"Giant Rat",3,-1,"d2"," "," ",11,15,2,2,2," - ",0,"Pierce","Bite"," - "," - ",6,8,2,1,1,-3,-3,-2,2,3,2,null,"Disease",null,{"$error":"#VALUE!"},{"$error":"#VALUE!"},null,4,20,null,"Crossbow","Coat of Plates"]
["Neurotoxin (15)",5,{"$f":"U13","v":71},"Giant Cobra",8,2,"d12 / d10"," "," ",21,9,"3/4",1,1,"Scales",0,{"$f":"VLOOKUP(R13,weapons,2, FALSE)","v":"Pierce"},"Bite"," - "," - ",{"$f":"INT(W13+X13*(4.5+AC13))-2","v":71},{"$f":"2*(W13+AC13)","v":32},10,6,3,7,-3,-2,6,2,2,null,null,null,{"$error":"#VALUE!"},{"$error":"#VALUE!"},null,5,22,null,"Battle-axe","Plate"]
[null,4,20,"Jaguar",7,3,"d6 / d4",-1," ",18,13,2,2,2," - ",0,{"$f":"VLOOKUP(R14,weapons,2, FALSE)","v":"Pierce"},"Bite","Claw"," - ",{"$f":"INT(W14+X14*(4.5+AC14))-2","v":20},{"$f":"2*(W14+AC14)","v":8},4,4,4,2,-3,0,0,4,3,null,null,null,{"$error":"#VALUE!"},{"$error":"#VALUE!"},null,6,24,null,"Battle-axe 2 hands","Hide"]
["crush 1-6",4,19,"Dire Weasel",8,2,"d8 / d4"," "," ",19,12,2,2,2," - ",0,"Pierce","Bite"," - "," - ",19,12,5,3,4,2,-3,-1,1,4,3,null,null,null,{"$error":"#VALUE!"},{"$error":"#VALUE!"},null,7,26,null,"Hand Axe","Thick Hide"]
[null,2,8,"Nandie",7,4,"d4",0,0,19,12,2,2,2," - ",0,"Slash","Claw","Claw","Bite",8,12,5,1,2,4,-2,0,1,5,3,null,null,null,{"$error":"#VALUE!"},{"$error":"#VALUE!"},null,8,28,null,"War Hammer","Scales"]
[null,2,8,"Nandie - Rocks",7,4,"d3"," "," ",18,12,2,2,2," - ",0,"Bludgeon","Missile"," - "," - ",8,12,5,1,2,4,-2,0,1,5,3,null,null,null,{"$error":"#VALUE!"},{"$error":"#VALUE!"},null,9,30,null,"Club","Armoured scales"]
[null,2,13,"Nandie-bear",7,4,"d8 / d4",3,3,19,10,"3/4","3/4","3/4","Hide",0,"Slash","Claw","Claw","Bite",13,22,8,1,2,7,-1,0,3,3,2,null,null,null,{"$error":"#VALUE!"},{"$error":"#VALUE!"},null,10,32,null,"Mace","Stone scales"]
[null,2,4,"Bloodhawk",8,0,"d2",-2,-2,16,24,2,2,2," - ",0,"Slash","Claw","Claw","Bite",4,4,2,1,2,-2,-2,0,0,5,4,3,null,null,{"$error":"#VALUE!"},{"$error":"#VALUE!"},null,null,null,null,"Morning Star","Dragon Scales"]
[null,1,4,"Weasel",4,-1,{"$error":"#N/A"},{"$f":"IF(S20<>\" - \",VLOOKUP(S20,weapons,3,FALSE)+VLOOKUP($W20,size,3),\" \")","v":-2},-2,13,15,2,2,2," - ",0,"Slash","Claw","Claw","Bite",4,4,2,1,0,-3,-2,0,0,5,4,null,null,null,{"$error":"#N/A"},{"$error":"#N/A"},null,null,null,null,"Morning Star-Flail","Bone"]
[null,2,3,"Beetle - Fire",3,6,"d2"," "," ",11,16,"1/4","1/4","1/4","Armoured scales",0,{"$f":"VLOOKUP(R21,weapons,2, FALSE)","v":"Pierce"},"Bite"," - "," - ",3,2,1,1,2,3,-4,0,0,1,-1,null,null,null,{"$error":"#VALUE!"},{"$error":"#VALUE!"},null,null,null,null,"Spear"]
[null,2,10,"Spider - Crab",5,-1,"d3"," "," ",13,14,2,2,2," - ",0,"Pierce","Bite"," - "," - ",{"$f":"INT(W22+X22*(4.5+AC22))-2","v":10},{"$f":"2*(W22+AC22)","v":6},3,2,2,-3,-3,-2,0,5,3,null,null,null,{"$error":"#VALUE!"},{"$error":"#VALUE!"},null,null,null,null,"Spear 2 hands"]
[null,3,10,"Spider - Trapdoor",7,-1,"d4"," "," ",14,14,2,2,2," - ",0,"Pierce","Bite"," - "," - ",{"$f":"INT(W23+X23*(4.5+AC23))-2","v":10},{"$f":"2*(W23+AC23)","v":6},3,2,3,-3,-3,-2,0,6,3,null,null,null,{"$error":"#VALUE!"},{"$error":"#VALUE!"},null,null,null,null,"Dagger"]
[null,2,19,"Crocodile",4,3,"2d4"," "," ",15,12,1,1.5,1.5,"Scales",0,"Pierce","Bite"," - "," - ",{"$f":"INT(W24+X24*(4.5+AC24))-2","v":19},{"$f":"2*(W24+AC24)","v":18},6,2,2,3,-1,-1,3,2,2,null,null,null,{"$error":"#VALUE!"},{"$error":"#VALUE!"},null,null,null,null,"Short sword"]
["Nausea",2,6,"Angoran Wormkin",2,3,"d3"," "," ",9,14,1,1,1,"Hide",0,"Pierce","Bite"," - "," - ",{"$f":"INT(W25+X25*(4.5+AC25))-2","v":6},{"$f":"2*(W25+AC25)","v":8},3,1,2,1,-2,0,1,2,0,null,null,null,{"$error":"#VALUE!"},{"$error":"#VALUE!"},null,null,null,null,"Scimitar"]
["14 = hug",3,23,"Black Bear",3,5,"d4",0,0.5,16,12,2,2,2," - ",0,"Slash","Claw","Claw","Hug",{"$f":"INT(W26+X26*(4.5+AC26))-2","v":23},{"$f":"2*(W26+AC26)","v":16},6,3,2,5,-3,-2,2,1,2,null,null,null,{"$error":"#VALUE!"},{"$error":"#VALUE!"},null,null,null,null,"Arming Sword"]
[null,0,null,null,{"$error":"#N/A"},4,{"$error":"#N/A"},{"$error":"#N/A"},{"$error":"#N/A"},{"$error":"#N/A"},17,{"$error":"#N/A"},{"$error":"#N/A"},{"$error":"#N/A"},null,null,null,null,null,null,null,null,null,null,null,null,null,null,null,null,null,null,null,null,{"$error":"#N/A"},{"$error":"#N/A"},null,null,null,null,"Bastard Sword"]
[null,0,null,null,{"$error":"#N/A"},4,{"$error":"#N/A"},{"$error":"#N/A"},{"$error":"#N/A"},{"$error":"#N/A"},17,{"$error":"#N/A"},{"$error":"#N/A"},{"$error":"#N/A"},null,null,null,null,null,null,null,null,null,null,null,null,null,null,null,null,null,null,null,null,{"$error":"#N/A"},{"$error":"#N/A"},null,null,null,null,"Great Sword"]
[null,0,null,null,{"$error":"#N/A"},4,{"$error":"#N/A"},{"$error":"#N/A"},{"$error":"#N/A"},{"$error":"#N/A"},17,{"$error":"#N/A"},{"$error":"#N/A"},{"$error":"#N/A"},null,null,null,null,null,null,null,null,null,null,null,null,null,null,null,null,null,null,null,null,{"$error":"#N/A"},{"$error":"#N/A"},null,null,null,null,"Staff"]
[null,0,null,null,{"$error":"#N/A"},4,{"$error":"#N/A"},{"$error":"#N/A"},{"$error":"#N/A"},{"$error":"#N/A"},17,{"$error":"#N/A"},{"$error":"#N/A"},{"$error":"#N/A"},null,null,null,null,null,null,null,null,null,null,null,null,null,null,null,null,null,null,null,null,{"$error":"#N/A"},{"$error":"#N/A"},null,null,null,null,"Missile"]
[null,0,null,null,{"$error":"#N/A"},4,{"$error":"#N/A"},{"$error":"#N/A"},{"$error":"#N/A"},{"$error":"#N/A"},17,{"$error":"#N/A"},{"$error":"#N/A"},{"$error":"#N/A"},null,null,null,null,null,null,null,null,null,null,null,null,null,null,null,null,null,null,null,null,{"$error":"#N/A"},{"$error":"#N/A"}]
[null,{"$f":"ROUNDUP((X32+Y32)/2,0)","v":0},null,null,{"$error":"#N/A"},4,{"$error":"#N/A"},{"$error":"#N/A"},{"$error":"#N/A"},{"$error":"#N/A"},17,{"$error":"#N/A"},{"$error":"#N/A"},{"$error":"#N/A"},null,null,null,null,null,null,null,null,null,null,null,null,null,null,null,null,null,null,null,null,{"$error":"#N/A"},{"$error":"#N/A"}]
[null,0,null,null,{"$error":"#N/A"},4,{"$error":"#N/A"},{"$error":"#N/A"},{"$error":"#N/A"},{"$error":"#N/A"},17,{"$error":"#N/A"},{"$error":"#N/A"},{"$error":"#N/A"},null,null,null,null,null,null,null,null,null,null,null,null,null,null,null,null,null,null,null,null,{"$error":"#N/A"},{"$error":"#N/A"}]
[null,0,null,null,{"$error":"#N/A"},4,{"$error":"#N/A"},{"$error":"#N/A"},{"$error":"#N/A"},{"$error":"#N/A"},17,{"$error":"#N/A"},{"$error":"#N/A"},{"$error":"#N/A"},null,null,null,null,null,null,null,null,null,null,null,null,null,null,null,null,null,null,null,null,{"$error":"#N/A"},{"$error":"#N/A"}]
[null,0,null,null,{"$error":"#N/A"},4,{"$error":"#N/A"},{"$error":"#N/A"},{"$error":"#N/A"},{"$error":"#N/A"},17,{"$error":"#N/A"},{"$error":"#N/A"},{"$error":"#N/A"},null,null,null,null,null,null,null,null,null,null,null,null,null,null,null,null,null,null,null,null,{"$error":"#N/A"},{"$error":"#N/A"}]
[null,0,null,null,{"$error":"#N/A"},4,{"$error":"#N/A"},{"$error":"#N/A"},{"$error":"#N/A"},{"$error":"#N/A"},17,{"$error":"#N/A"},{"$error":"#N/A"},{"$error":"#N/A"}]
[null,null,null,null,{"$error":"#N/A"},4,{"$error":"#N/A"},{"$error":"#N/A"},{"$error":"#N/A"},{"$error":"#N/A"},17,{"$error":"#N/A"},{"$error":"#N/A"},{"$error":"#N/A"}]
[null,null,null,null,{"$error":"#N/A"},4,{"$error":"#N/A"},{"$error":"#N/A"},{"$error":"#N/A"},{"$error":"#N/A"},17,{"$error":"#N/A"},{"$error":"#N/A"},{"$error":"#N/A"}]
[null,null,null,null,{"$error":"#N/A"},4,{"$error":"#N/A"},{"$f":"IF(S39<>\" - \",VLOOKUP(S39,weapons,3,FALSE)+VLOOKUP($W39,size,3),\" \")","v":{"$error":"#N/A"}},{"$f":"IF(T39<>\" - \",VLOOKUP(T39,weapons,3,FALSE)+VLOOKUP($W39,size,3),\" \")","v":{"$error":"#N/A"}},{"$error":"#N/A"},{"$f":"12+P39+VLOOKUP(W39,size,5)+AF39*3","v":17},{"$error":"#N/A"},{"$error":"#N/A"},{"$error":"#N/A"}]

{"sheet":"Monsters","index":6,"n_rows":39,"n_cols":43,"rows_kept":39,"cut":false,"hidden":false,"merged":[[0,20,0,21],[0,14,0,15],[0,6,0,8],[0,0,1,0],[0,1,1,1],[0,2,1,2],[0,9,0,10]]}
["Special","Save","Stamina Points",null,"Atk","Dmg \nbonus","Damage \nLevel",null,null,"Defence",null,"Absorb",null,null,"Armour",null,"Attack","Attack",null,null,"Health",null,"Size",null,null,null,null,"Attributes",null,null,null,"Flying","Ability"]
[null,null,null,null,null,null,"Dmg","Dmg","Dmg","Parry","Range","Cut","Thrust","Chop","Body","Shield","Type","Weapon","Weapon","Weapon","SP","WP","feet","HD","Skill","Str","Int","Will","Con","Dex","Alert","Class",null,null,"Exp","total",null,"Attributes",null,null,"Weapon","Body Armour","Breast Plate"]
[null,null,null,null,null,null,null,null,null,null,null,null,null,null,null,null,null,null,null,null,null,null,null,null,null,null,null,null,null,null,null,null,null,null,null,null,null,"New","Old",null," - "," - ","-"]
[null,{"$f":"ROUNDUP((X4+Y4)/2,0)","v":3},{"$f":"U4","v":38},"Gargoyle",{"$f":"Y4+ROUNDUP(AF4/2,0)+INT(+VLOOKUP(R4,weapons,3,FALSE)*MIN(Z4,8)+VLOOKUP(R4,weapons,4,FALSE)*(AD4))+VLOOKUP(W4,size,4)","v":5},{"$f":"Z4-VLOOKUP($W4,size,3)","v":2},{"$f":"VLOOKUP(VLOOKUP(R4,weapons,6,FALSE)+VLOOKUP($W4,size,3)+Y4-1,New_damage,2,FALSE)","v":"d4"},{"$f":"IF(S4<>\" - \",VLOOKUP(S4,weapons,3,FALSE)+VLOOKUP($W4,size,3),\" \")","v":0},0,{"$f":"INT(VLOOKUP(O4,body_armour,5,FALSE)+Y4+AE4+P4+VLOOKUP(W4,size,6)+(Z4+AD4)/2+VLOOKUP(R4,weapons,5,FALSE)/2 )","v":12},{"$f":"12+P4+VLOOKUP(W4,size,5)+AF4*3","v":21},{"$f":"VLOOKUP(VLOOKUP($O4,body_armour,2,FALSE)+IF($W4>6,INT(VLOOKUP($W4,size,7)),0),Armour_translation,2,FALSE)","v":"1/5"},{"$f":"VLOOKUP(VLOOKUP($O4,body_armour,3,FALSE)+IF($W4>6,INT(VLOOKUP($W4,size,7)),0),Armour_translation,2,FALSE)","v":"1/5"},{"$f":"VLOOKUP(VLOOKUP($O4,body_armour,4,FALSE)+IF($W4>6,INT(VLOOKUP($W4,size,7)),0),Armour_translation,2,FALSE)","v":"1/3"},"Stone scales",0,{"$f":"VLOOKUP(R4,weapons,2, FALSE)","v":"Slash"},"Claw","Claw","Bite",{"$f":"INT(W4+X4*(4.5+AC4))-2","v":38},{"$f":"2*(W4+AC4)","v":20},6,4,2,2,0,0,4,1,0,3,null,null,{"$f":"(5+E4)*(10+IF(AF4>0,M4,J4))*((10+F4+G4))*U4*(5+N4)/1000*VLOOKUP(AG4,Specials,3,FALSE)+VLOOKUP(AG4,Specials,2,FALSE)","v":{"$error":"#VALUE!"}},{"$f":"AH4*AI4*VLOOKUP(AH4,Attackers,2,TRUE)","v":{"$error":"#VALUE!"}},null,-3,4,null,"Claw","Leather","Leather"]
[null,8,81,"Sussurus",10,3,"d12 / d10",1,1,21,12,"1/5","1/5","1/3","Stone scales",1,"Slash","Claw","Claw","Bite",81,{"$f":"2*(W5+AC5)","v":24},7,8,8,4,0,0,5,1,0,null,null,null,{"$error":"#VALUE!"},{"$error":"#VALUE!"},null,-2,6,null,"Thump","Padded","Metal"]
[null,5,31,"Embertree",4,0,"d6 / d4"," "," ",14,15,1,1,"3/4","Scale (Leather)",3,"Bludgeon","Thump"," - "," - ",31,{"$f":"2*(W6+AC6)","v":14},6,5,5,0,0,0,1,-1,0,null,null,null,{"$error":"#VALUE!"},{"$error":"#VALUE!"},null,-1,8,null,"Bite","Scale (Leather)"]
[null,2,11,"Berbelang",5,2,"2d4",0,0,15,18,1,1.5,1.5,"Leather",0,"Slash","Claw","Claw","Bite",11,{"$f":"2*(W7+AC7)","v":18},6,1,3,2,2,2,3,1,2,2,null,null,{"$error":"#VALUE!"},{"$error":"#VALUE!"},null,0,11,null,"Hug","Boiled Leather"]
[null,2,5,"Stirge",6,1,"d4"," "," ",12,23,2,2,2," - ",0,"Pierce","Bite"," - "," - ",5,{"$f":"2*(W8+AC8)","v":6},3,1,3,-1,-1,0,0,3,1,3,null,null,{"$error":"#VALUE!"},{"$error":"#VALUE!"},null,1,14,null,"Cleaver","Scale (Iron)"]
[null,1,4,"Wall hugger",0,2,"d3"," "," ",8,13,2,2,2," - ",null,"Bludgeon","Hug"," - "," - ",4,10,4,0.5,0,1,-1,-2,0,1,-1,null,null,null,{"$error":"#VALUE!"},{"$error":"#VALUE!"},null,2,16,null,"Bow - Short","Mail Hauberk"]
[null,null,null,null,{"$error":"#N/A"},4,{"$error":"#N/A"},{"$error":"#N/A"},{"$error":"#N/A"},{"$error":"#N/A"},17,{"$error":"#N/A"},{"$error":"#N/A"},{"$error":"#N/A"},null,null,null,null,null,null,null,null,null,null,null,null,null,null,null,null,null,null,null,null,{"$error":"#N/A"},{"$error":"#N/A"},null,3,18,null,"Bow - Long","Mail"]
["break <6",3,30,"Carytid Column",4,5,"d8 / d6"," "," ",13,12,"1/5","1/5","1/3","Stone scales",0,{"$f":"VLOOKUP(R11,weapons,2, FALSE)","v":"Slash"},"Scimitar"," - "," - ",30,{"$f":"2*(W11+AC11)","v":16},6,4,2,5,-2,0,2,-1,0,null,null,null,{"$error":"#VALUE!"},{"$error":"#VALUE!"},null,4,20,null,"Crossbow","Coat of Plates"]
[null,0,null,null,{"$error":"#N/A"},4,{"$error":"#N/A"},{"$error":"#N/A"},{"$error":"#N/A"},{"$error":"#N/A"},17,{"$error":"#N/A"},{"$error":"#N/A"},{"$error":"#N/A"},null,null,null,null,null,null,null,null,null,null,null,null,null,null,null,null,null,null,null,null,{"$error":"#N/A"},{"$error":"#N/A"},null,5,22,null,"Battle-axe","Plate"]
[null,0,null,null,{"$error":"#N/A"},4,{"$error":"#N/A"},{"$error":"#N/A"},{"$error":"#N/A"},{"$error":"#N/A"},17,{"$error":"#N/A"},{"$error":"#N/A"},{"$error":"#N/A"},null,null,null,null,null,null,null,null,null,null,null,null,null,null,null,null,null,null,null,null,{"$error":"#N/A"},{"$error":"#N/A"},null,6,24,null,"Battle-axe 2 hands","Hide"]
[null,0,null,null,{"$error":"#N/A"},4,{"$error":"#N/A"},{"$error":"#N/A"},{"$error":"#N/A"},{"$error":"#N/A"},17,{"$error":"#N/A"},{"$error":"#N/A"},{"$error":"#N/A"},null,null,null,null,null,null,null,null,null,null,null,null,null,null,null,null,null,null,null,null,{"$error":"#N/A"},{"$error":"#N/A"},null,7,26,null,"Hand Axe","Thick Hide"]
[null,0,null,null,{"$error":"#N/A"},4,{"$error":"#N/A"},{"$error":"#N/A"},{"$error":"#N/A"},{"$error":"#N/A"},17,{"$error":"#N/A"},{"$error":"#N/A"},{"$error":"#N/A"},null,null,null,null,null,null,null,null,null,null,null,null,null,null,null,null,null,null,null,null,{"$error":"#N/A"},{"$error":"#N/A"},null,8,28,null,"War Hammer","Scales"]
[null,0,null,null,{"$error":"#N/A"},4,{"$error":"#N/A"},{"$error":"#N/A"},{"$error":"#N/A"},{"$error":"#N/A"},17,{"$error":"#N/A"},{"$error":"#N/A"},{"$error":"#N/A"},null,null,null,null,null,null,null,null,null,null,null,null,null,null,null,null,null,null,null,null,{"$error":"#N/A"},{"$error":"#N/A"},null,9,30,null,"Club","Armoured scales"]
[null,0,null,null,{"$error":"#N/A"},4,{"$error":"#N/A"},{"$error":"#N/A"},{"$error":"#N/A"},{"$error":"#N/A"},17,{"$error":"#N/A"},{"$error":"#N/A"},{"$error":"#N/A"},null,null,null,null,null,null,null,null,null,null,null,null,null,null,null,null,null,null,null,null,{"$error":"#N/A"},{"$error":"#N/A"},null,10,32,null,"Mace","Stone scales"]
[null,0,null,null,{"$error":"#N/A"},4,{"$error":"#N/A"},{"$error":"#N/A"},{"$error":"#N/A"},{"$error":"#N/A"},17,{"$error":"#N/A"},{"$error":"#N/A"},{"$error":"#N/A"},null,null,null,null,null,null,null,null,null,null,null,null,null,null,null,null,null,null,null,null,{"$error":"#N/A"},{"$error":"#N/A"},null,null,null,null,"Morning Star","Dragon Scales"]
[null,0,null,null,{"$error":"#N/A"},4,{"$error":"#N/A"},{"$error":"#N/A"},{"$error":"#N/A"},{"$error":"#N/A"},17,{"$error":"#N/A"},{"$error":"#N/A"},{"$error":"#N/A"},null,null,null,null,null,null,null,null,null,null,null,null,null,null,null,null,null,null,null,null,{"$error":"#N/A"},{"$error":"#N/A"},null,null,null,null,"Morning Star-Flail","Bone"]
[null,0,null,null,{"$error":"#N/A"},4,{"$error":"#N/A"},{"$f":"IF(S20<>\" - \",VLOOKUP(S20,weapons,3,FALSE)+VLOOKUP($W20,size,3),\" \")","v":{"$error":"#N/A"}},{"$error":"#N/A"},{"$error":"#N/A"},17,{"$error":"#N/A"},{"$error":"#N/A"},{"$error":"#N/A"},null,null,null,null,null,null,null,null,null,null,null,null,null,null,null,null,null,null,null,null,{"$error":"#N/A"},{"$error":"#N/A"},null,null,null,null,"Spear"]
[null,0,null,null,{"$error":"#N/A"},4,{"$error":"#N/A"},{"$error":"#N/A"},{"$error":"#N/A"},{"$error":"#N/A"},17,{"$error":"#N/A"},{"$error":"#N/A"},{"$error":"#N/A"},null,null,null,null,null,null,null,null,null,null,null,null,null,null,null,null,null,null,null,null,{"$error":"#N/A"},{"$error":"#N/A"},null,null,null,null,"Spear 2 hands"]
[null,0,null,null,{"$error":"#N/A"},4,{"$error":"#N/A"},{"$error":"#N/A"},{"$error":"#N/A"},{"$error":"#N/A"},17,{"$error":"#N/A"},{"$error":"#N/A"},{"$error":"#N/A"},null,null,null,null,null,null,null,null,null,null,null,null,null,null,null,null,null,null,null,null,{"$error":"#N/A"},{"$error":"#N/A"},null,null,null,null,"Dagger"]
[null,0,null,null,{"$error":"#N/A"},4,{"$error":"#N/A"},{"$error":"#N/A"},{"$error":"#N/A"},{"$error":"#N/A"},17,{"$error":"#N/A"},{"$error":"#N/A"},{"$error":"#N/A"},null,null,null,null,null,null,null,null,null,null,null,null,null,null,null,null,null,null,null,null,{"$error":"#N/A"},{"$error":"#N/A"},null,null,null,null,"Cutlass"]
[null,0,null,null,{"$error":"#N/A"},4,{"$error":"#N/A"},{"$error":"#N/A"},{"$error":"#N/A"},{"$error":"#N/A"},17,{"$error":"#N/A"},{"$error":"#N/A"},{"$error":"#N/A"},null,null,null,null,null,null,null,null,null,null,null,null,null,null,null,null,null,null,null,null,{"$error":"#N/A"},{"$error":"#N/A"},null,null,null,null,"Falchion"]
[null,0,null,null,{"$error":"#N/A"},4,{"$error":"#N/A"},{"$error":"#N/A"},{"$error":"#N/A"},{"$error":"#N/A"},17,{"$error":"#N/A"},{"$error":"#N/A"},{"$error":"#N/A"},null,null,null,null,null,null,null,null,null,null,null,null,null,null,null,null,null,null,null,null,{"$error":"#N/A"},{"$error":"#N/A"},null,null,null,null,"Short sword"]
[null,0,null,null,{"$error":"#N/A"},4,{"$error":"#N/A"},{"$error":"#N/A"},{"$error":"#N/A"},{"$error":"#N/A"},17,{"$error":"#N/A"},{"$error":"#N/A"},{"$error":"#N/A"},null,null,null,null,null,null,null,null,null,null,null,null,null,null,null,null,null,null,null,null,{"$error":"#N/A"},{"$error":"#N/A"},null,null,null,null,"Scimitar"]
[null,0,null,null,{"$error":"#N/A"},4,{"$error":"#N/A"},{"$error":"#N/A"},{"$error":"#N/A"},{"$error":"#N/A"},17,{"$error":"#N/A"},{"$error":"#N/A"},{"$error":"#N/A"},null,null,null,null,null,null,null,null,null,null,null,null,null,null,null,null,null,null,null,null,{"$error":"#N/A"},{"$error":"#N/A"},null,null,null,null,"Arming Sword"]
[null,0,null,null,{"$error":"#N/A"},4,{"$error":"#N/A"},{"$error":"#N/A"},{"$error":"#N/A"},{"$error":"#N/A"},17,{"$error":"#N/A"},{"$error":"#N/A"},{"$error":"#N/A"},null,null,null,null,null,null,null,null,null,null,null,null,null,null,null,null,null,null,null,null,{"$error":"#N/A"},{"$error":"#N/A"},null,null,null,null,"Bastard Sword"]
[null,0,null,null,{"$error":"#N/A"},4,{"$error":"#N/A"},{"$error":"#N/A"},{"$error":"#N/A"},{"$error":"#N/A"},17,{"$error":"#N/A"},{"$error":"#N/A"},{"$error":"#N/A"},null,null,null,null,null,null,null,null,null,null,null,null,null,null,null,null,null,null,null,null,{"$error":"#N/A"},{"$error":"#N/A"},null,null,null,null,"Great Sword"]
[null,0,null,null,{"$error":"#N/A"},4,{"$error":"#N/A"},{"$error":"#N/A"},{"$error":"#N/A"},{"$error":"#N/A"},17,{"$error":"#N/A"},{"$error":"#N/A"},{"$error":"#N/A"},null,null,null,null,null,null,null,null,null,null,null,null,null,null,null,null,null,null,null,null,{"$error":"#N/A"},{"$error":"#N/A"},null,null,null,null,"Staff"]
[null,0,null,null,{"$error":"#N/A"},4,{"$error":"#N/A"},{"$error":"#N/A"},{"$error":"#N/A"},{"$error":"#N/A"},17,{"$error":"#N/A"},{"$error":"#N/A"},{"$error":"#N/A"},null,null,null,null,null,null,null,null,null,null,null,null,null,null,null,null,null,null,null,null,{"$error":"#N/A"},{"$error":"#N/A"},null,null,null,null,"Missile"]
[null,{"$f":"ROUNDUP((X32+Y32)/2,0)","v":0},null,null,{"$error":"#N/A"},4,{"$error":"#N/A"},{"$error":"#N/A"},{"$error":"#N/A"},{"$error":"#N/A"},17,{"$error":"#N/A"},{"$error":"#N/A"},{"$error":"#N/A"},null,null,null,null,null,null,null,null,null,null,null,null,null,null,null,null,null,null,null,null,{"$error":"#N/A"},{"$error":"#N/A"}]
[null,0,null,null,{"$error":"#N/A"},4,{"$error":"#N/A"},{"$error":"#N/A"},{"$error":"#N/A"},{"$error":"#N/A"},17,{"$error":"#N/A"},{"$error":"#N/A"},{"$error":"#N/A"},null,null,null,null,null,null,null,null,null,null,null,null,null,null,null,null,null,null,null,null,{"$error":"#N/A"},{"$error":"#N/A"}]
[null,0,null,null,{"$error":"#N/A"},4,{"$error":"#N/A"},{"$error":"#N/A"},{"$error":"#N/A"},{"$error":"#N/A"},17,{"$error":"#N/A"},{"$error":"#N/A"},{"$error":"#N/A"},null,null,null,null,null,null,null,null,null,null,null,null,null,null,null,null,null,null,null,null,{"$error":"#N/A"},{"$error":"#N/A"}]
[null,0,null,null,{"$error":"#N/A"},4,{"$error":"#N/A"},{"$error":"#N/A"},{"$error":"#N/A"},{"$error":"#N/A"},17,{"$error":"#N/A"},{"$error":"#N/A"},{"$error":"#N/A"},null,null,null,null,null,null,null,null,null,null,null,null,null,null,null,null,null,null,null,null,{"$error":"#N/A"},{"$error":"#N/A"}]
[null,0,null,null,{"$error":"#N/A"},4,{"$error":"#N/A"},{"$error":"#N/A"},{"$error":"#N/A"},{"$error":"#N/A"},17,{"$error":"#N/A"},{"$error":"#N/A"},{"$error":"#N/A"}]
[null,null,null,null,{"$error":"#N/A"},4,{"$error":"#N/A"},{"$error":"#N/A"},{"$error":"#N/A"},{"$error":"#N/A"},17,{"$error":"#N/A"},{"$error":"#N/A"},{"$error":"#N/A"}]
[null,null,null,null,{"$error":"#N/A"},4,{"$error":"#N/A"},{"$error":"#N/A"},{"$error":"#N/A"},{"$error":"#N/A"},17,{"$error":"#N/A"},{"$error":"#N/A"},{"$error":"#N/A"}]
[null,null,null,null,{"$error":"#N/A"},4,{"$error":"#N/A"},{"$f":"IF(S39<>\" - \",VLOOKUP(S39,weapons,3,FALSE)+VLOOKUP($W39,size,3),\" \")","v":{"$error":"#N/A"}},{"$error":"#N/A"},{"$error":"#N/A"},17,{"$error":"#N/A"},{"$error":"#N/A"},{"$error":"#N/A"}]

{"sheet":"Special","index":7,"n_rows":39,"n_cols":40,"rows_kept":39,"cut":false,"hidden":false,"merged":[[0,20,0,21],[0,14,0,15],[0,6,0,8],[0,0,1,0],[0,1,1,1],[0,2,1,2],[0,9,0,10]]}
["Special","Save","Stamina Points",null,"Atk","Dmg \nbonus","Damage \nLevel",null,null,"Defence",null,"Absorb",null,null,"Armour",null,"Attack","Attack",null,null,"Health",null,"Size",null,null,null,null,"Attributes",null,null,null,"Flight","Ability"]
[null,null,null,null,null,null,"Dmg","Dmg","Dmg","Parry","Range","Cut","Thrust","Chop","Body","Shield","Type","Weapon","Weapon","Weapon","SP","WP","feet","HD","Skill","Str","Int","Will","Con","Dex","Alert","Class",null,null,"Exp","total",null,"Weapon","Body Armour","Breast Plate"]
[null,null,null,null,null,null,null,null,null,null,null,null,null,null,null,null,null,null,null,null,null,null,null,null,null,null,null,null,null,null,null,null,null,null,null,null,null," - "," - ","-"]
[null,{"$f":"ROUNDUP((X4+Y4)/2,0)","v":3},{"$f":"U4","v":9},"Dagger",{"$f":"Y4+ROUNDUP(AF4/2,0)+INT(+VLOOKUP(R4,weapons,3,FALSE)*MIN(Z4,8)+VLOOKUP(R4,weapons,4,FALSE)*(AD4))+VLOOKUP(W4,size,4)","v":12},{"$f":"Z4-VLOOKUP($W4,size,3)","v":5},{"$f":"VLOOKUP(VLOOKUP(R4,weapons,6,FALSE)+VLOOKUP($W4,size,3)+Y4-1,New_damage,2,FALSE)","v":"d3"},{"$f":"IF(S4<>\" - \",VLOOKUP(S4,weapons,3,FALSE)+VLOOKUP($W4,size,3),\" \")","v":" "}," ",{"$f":"INT(VLOOKUP(O4,body_armour,5,FALSE)+Y4+AE4+P4+VLOOKUP(W4,size,6)+(Z4+AD4)/2+VLOOKUP(R4,weapons,5,FALSE)/2 )","v":15},{"$f":"12+P4+VLOOKUP(W4,size,5)+AF4*3","v":32},{"$f":"VLOOKUP(VLOOKUP($O4,body_armour,2,FALSE)+IF($W4>6,INT(VLOOKUP($W4,size,7)),0),Armour_translation,2,FALSE)","v":"1/5"},{"$f":"VLOOKUP(VLOOKUP($O4,body_armour,3,FALSE)+IF($W4>6,INT(VLOOKUP($W4,size,7)),0),Armour_translation,2,FALSE)","v":"1/4"},{"$f":"VLOOKUP(VLOOKUP($O4,body_armour,4,FALSE)+IF($W4>6,INT(VLOOKUP($W4,size,7)),0),Armour_translation,2,FALSE)","v":"1/3"},"Plate",0,{"$f":"VLOOKUP(R4,weapons,2, FALSE)","v":"Pierce"},"Dagger"," - "," - ",{"$f":"INT(W4+X4*(4.5+AC4))+3","v":9},{"$f":"2*(W4+AC4)","v":3},0.5,1,4,1,-3,0,1,4,2,5,null,null,{"$f":"(5+E4)*(10+IF(AF4>0,M4,J4))*((10+F4+G4))*U4*(5+N4)/1000*VLOOKUP(AG4,Specials,3,FALSE)+VLOOKUP(AG4,Specials,2,FALSE)","v":{"$error":"#VALUE!"}},{"$f":"AH4*AI4*VLOOKUP(AH4,Attackers,2,TRUE)","v":{"$error":"#VALUE!"}},null,"Claw","Leather","Leather"]
[null,8,{"$f":"U5","v":63},"Susurrus",12,0,"2d12 + 2d4",3,3,22,10,"1/5","1/5","1/5","Armoured scales",0,"Bludgeon","Hug","Claw","Claw",63,20,8,8,8,3,-1,-1,2,1,2,null,null,null,{"$error":"#VALUE!"},{"$error":"#VALUE!"},null,"Thump","Padded","Metal"]
[null,4,{"$f":"U6","v":34},"Shadow Dancer",8,5,"d8 / d4",0," ",20,12,"1/5","1/5","1/3","Stone scales",0,"Slash","Claw","Claw"," - ",34,20,6,3,5,5,-2,-2,4,3,3,null,null,null,{"$error":"#VALUE!"},{"$error":"#VALUE!"},null,"Bite","Scale (Leather)"]
[null,6,{"$f":"U7","v":56},"Thraak",7,5,"d10 / d8",3," ",22,10,"3/4",1,1,"Leather",0,"Slash","Claw","Claw"," - ",56,20,8,7,5,8,-1,-1,2,0,3,null,null,null,{"$error":"#VALUE!"},{"$error":"#VALUE!"},null,"Hug","Boiled Leather"]
[null,3,{"$f":"U8","v":44},"Pellarn Statue",11,2,"d8 / d6"," "," ",9,9,"1/5","1/4","1/3","Coat of Plates",0,"Bludgeon","Club"," - "," - ",44,28,11,4,1,7,-5,-3,3,-2,-2,null,null,null,{"$error":"#VALUE!"},{"$error":"#VALUE!"},null,"Cleaver","Scale (Iron)"]
[null,6,null,null,7,1,"2d12+d2"," "," ",16,14,"1/4","1/3","1/2","Coat of Plates",2,"Slash","Bastard Sword"," - "," - ",48,16,6,6,6,1,0,1,2,1,0,null,null,null,{"$error":"#VALUE!"},{"$error":"#VALUE!"},null,"Bow - Short","Mail Hauberk"]
[null,1,null,null,2,-1,"d2"," "," ",10,15,2,2,2," - ",0,"Pierce","Bite"," - "," - ",{"$f":"INT(W10+X10*(4.5+AC10))-2","v":5},6,2,1,1,-3,-3,-3,1,2,2,null,null,null,{"$error":"#VALUE!"},{"$error":"#VALUE!"},null,"Bow - Long","Mail"]
[null,5,null,null,1,3,"d6 / d4"," "," ",12,10,"3/4","3/4","3/4","Hide",0,"Pierce","Bite"," - "," - ",{"$f":"INT(W11+X11*(4.5+AC11))-2","v":71},20,8,10,0,6,-3,-1,2,-1,0,null,null,null,{"$error":"#VALUE!"},{"$error":"#VALUE!"},null,"Crossbow","Coat of Plates"]
[null,0,null,null,{"$error":"#N/A"},4,{"$error":"#N/A"},{"$error":"#N/A"},{"$error":"#N/A"},{"$error":"#N/A"},17,{"$error":"#N/A"},{"$error":"#N/A"},{"$error":"#N/A"},null,null,null,null,null,null,null,null,null,null,null,null,null,null,null,null,null,null,null,null,{"$error":"#N/A"},{"$error":"#N/A"},null,"Battle-axe","Plate"]
[null,0,null,null,{"$error":"#N/A"},4,{"$error":"#N/A"},{"$error":"#N/A"},{"$error":"#N/A"},{"$error":"#N/A"},17,{"$error":"#N/A"},{"$error":"#N/A"},{"$error":"#N/A"},null,null,null,null,null,null,null,null,null,null,null,null,null,null,null,null,null,null,null,null,{"$error":"#N/A"},{"$error":"#N/A"},null,"Battle-axe 2 hands","Hide"]
[null,0,null,null,{"$error":"#N/A"},4,{"$error":"#N/A"},{"$error":"#N/A"},{"$error":"#N/A"},{"$error":"#N/A"},17,{"$error":"#N/A"},{"$error":"#N/A"},{"$error":"#N/A"},null,null,null,null,null,null,null,null,null,null,null,null,null,null,null,null,null,null,null,null,{"$error":"#N/A"},{"$error":"#N/A"},null,"Hand Axe","Thick Hide"]
[null,0,null,null,{"$error":"#N/A"},4,{"$error":"#N/A"},{"$error":"#N/A"},{"$error":"#N/A"},{"$error":"#N/A"},17,{"$error":"#N/A"},{"$error":"#N/A"},{"$error":"#N/A"},null,null,null,null,null,null,null,null,null,null,null,null,null,null,null,null,null,null,null,null,{"$error":"#N/A"},{"$error":"#N/A"},null,"War Hammer","Scales"]
[null,0,null,null,{"$error":"#N/A"},4,{"$error":"#N/A"},{"$error":"#N/A"},{"$error":"#N/A"},{"$error":"#N/A"},17,{"$error":"#N/A"},{"$error":"#N/A"},{"$error":"#N/A"},null,null,null,null,null,null,null,null,null,null,null,null,null,null,null,null,null,null,null,null,{"$error":"#N/A"},{"$error":"#N/A"},null,"Club","Armoured scales"]
[null,0,null,null,{"$error":"#N/A"},4,{"$error":"#N/A"},{"$error":"#N/A"},{"$error":"#N/A"},{"$error":"#N/A"},17,{"$error":"#N/A"},{"$error":"#N/A"},{"$error":"#N/A"},null,null,null,null,null,null,null,null,null,null,null,null,null,null,null,null,null,null,null,null,{"$error":"#N/A"},{"$error":"#N/A"},null,"Mace","Stone scales"]
[null,0,null,null,{"$error":"#N/A"},4,{"$error":"#N/A"},{"$error":"#N/A"},{"$error":"#N/A"},{"$error":"#N/A"},17,{"$error":"#N/A"},{"$error":"#N/A"},{"$error":"#N/A"},null,null,null,null,null,null,null,null,null,null,null,null,null,null,null,null,null,null,null,null,{"$error":"#N/A"},{"$error":"#N/A"},null,"Morning Star","Dragon Scales"]
[null,0,null,null,{"$error":"#N/A"},4,{"$error":"#N/A"},{"$error":"#N/A"},{"$error":"#N/A"},{"$error":"#N/A"},17,{"$error":"#N/A"},{"$error":"#N/A"},{"$error":"#N/A"},null,null,null,null,null,null,null,null,null,null,null,null,null,null,null,null,null,null,null,null,{"$error":"#N/A"},{"$error":"#N/A"},null,"Morning Star-Flail","Bone"]
[null,0,null,null,{"$error":"#N/A"},4,{"$error":"#N/A"},{"$f":"IF(S20<>\" - \",VLOOKUP(S20,weapons,3,FALSE)+VLOOKUP($W20,size,3),\" \")","v":{"$error":"#N/A"}},{"$error":"#N/A"},{"$error":"#N/A"},17,{"$error":"#N/A"},{"$error":"#N/A"},{"$error":"#N/A"},null,null,null,null,null,null,null,null,null,null,null,null,null,null,null,null,null,null,null,null,{"$error":"#N/A"},{"$error":"#N/A"},null,"Spear"]
[null,0,null,null,{"$error":"#N/A"},4,{"$error":"#N/A"},{"$error":"#N/A"},{"$error":"#N/A"},{"$error":"#N/A"},17,{"$error":"#N/A"},{"$error":"#N/A"},{"$error":"#N/A"},null,null,null,null,null,null,null,null,null,null,null,null,null,null,null,null,null,null,null,null,{"$error":"#N/A"},{"$error":"#N/A"},null,"Spear 2 hands"]
[null,0,null,null,{"$error":"#N/A"},4,{"$error":"#N/A"},{"$error":"#N/A"},{"$error":"#N/A"},{"$error":"#N/A"},17,{"$error":"#N/A"},{"$error":"#N/A"},{"$error":"#N/A"},null,null,null,null,null,null,null,null,null,null,null,null,null,null,null,null,null,null,null,null,{"$error":"#N/A"},{"$error":"#N/A"},null,"Dagger"]
[null,0,null,null,{"$error":"#N/A"},4,{"$error":"#N/A"},{"$error":"#N/A"},{"$error":"#N/A"},{"$error":"#N/A"},17,{"$error":"#N/A"},{"$error":"#N/A"},{"$error":"#N/A"},null,null,null,null,null,null,null,null,null,null,null,null,null,null,null,null,null,null,null,null,{"$error":"#N/A"},{"$error":"#N/A"},null,"Cutlass"]
[null,0,null,null,{"$error":"#N/A"},4,{"$error":"#N/A"},{"$error":"#N/A"},{"$error":"#N/A"},{"$error":"#N/A"},17,{"$error":"#N/A"},{"$error":"#N/A"},{"$error":"#N/A"},null,null,null,null,null,null,null,null,null,null,null,null,null,null,null,null,null,null,null,null,{"$error":"#N/A"},{"$error":"#N/A"},null,"Falchion"]
[null,0,null,null,{"$error":"#N/A"},4,{"$error":"#N/A"},{"$error":"#N/A"},{"$error":"#N/A"},{"$error":"#N/A"},17,{"$error":"#N/A"},{"$error":"#N/A"},{"$error":"#N/A"},null,null,null,null,null,null,null,null,null,null,null,null,null,null,null,null,null,null,null,null,{"$error":"#N/A"},{"$error":"#N/A"},null,"Short sword"]
[null,0,null,null,{"$error":"#N/A"},4,{"$error":"#N/A"},{"$error":"#N/A"},{"$error":"#N/A"},{"$error":"#N/A"},17,{"$error":"#N/A"},{"$error":"#N/A"},{"$error":"#N/A"},null,null,null,null,null,null,null,null,null,null,null,null,null,null,null,null,null,null,null,null,{"$error":"#N/A"},{"$error":"#N/A"},null,"Scimitar"]
[null,0,null,null,{"$error":"#N/A"},4,{"$error":"#N/A"},{"$error":"#N/A"},{"$error":"#N/A"},{"$error":"#N/A"},17,{"$error":"#N/A"},{"$error":"#N/A"},{"$error":"#N/A"},null,null,null,null,null,null,null,null,null,null,null,null,null,null,null,null,null,null,null,null,{"$error":"#N/A"},{"$error":"#N/A"},null,"Arming Sword"]
[null,0,null,null,{"$error":"#N/A"},4,{"$error":"#N/A"},{"$error":"#N/A"},{"$error":"#N/A"},{"$error":"#N/A"},17,{"$error":"#N/A"},{"$error":"#N/A"},{"$error":"#N/A"},null,null,null,null,null,null,null,null,null,null,null,null,null,null,null,null,null,null,null,null,{"$error":"#N/A"},{"$error":"#N/A"},null,"Bastard Sword"]
[null,0,null,null,{"$error":"#N/A"},4,{"$error":"#N/A"},{"$error":"#N/A"},{"$error":"#N/A"},{"$error":"#N/A"},17,{"$error":"#N/A"},{"$error":"#N/A"},{"$error":"#N/A"},null,null,null,null,null,null,null,null,null,null,null,null,null,null,null,null,null,null,null,null,{"$error":"#N/A"},{"$error":"#N/A"},null,"Great Sword"]
[null,0,null,null,{"$error":"#N/A"},4,{"$error":"#N/A"},{"$error":"#N/A"},{"$error":"#N/A"},{"$error":"#N/A"},17,{"$error":"#N/A"},{"$error":"#N/A"},{"$error":"#N/A"},null,null,null,null,null,null,null,null,null,null,null,null,null,null,null,null,null,null,null,null,{"$error":"#N/A"},{"$error":"#N/A"},null,"Staff"]
[null,0,null,null,{"$error":"#N/A"},4,{"$error":"#N/A"},{"$error":"#N/A"},{"$error":"#N/A"},{"$error":"#N/A"},17,{"$error":"#N/A"},{"$error":"#N/A"},{"$error":"#N/A"},null,null,null,null,null,null,null,null,null,null,null,null,null,null,null,null,null,null,null,null,{"$error":"#N/A"},{"$error":"#N/A"},null,"Missile"]
[null,{"$f":"ROUNDUP((X32+Y32)/2,0)","v":0},null,null,{"$error":"#N/A"},4,{"$error":"#N/A"},{"$error":"#N/A"},{"$error":"#N/A"},{"$error":"#N/A"},17,{"$error":"#N/A"},{"$error":"#N/A"},{"$error":"#N/A"},null,null,null,null,null,null,null,null,null,null,null,null,null,null,null,null,null,null,null,null,{"$error":"#N/A"},{"$error":"#N/A"}]
[null,0,null,null,{"$error":"#N/A"},4,{"$error":"#N/A"},{"$error":"#N/A"},{"$error":"#N/A"},{"$error":"#N/A"},17,{"$error":"#N/A"},{"$error":"#N/A"},{"$error":"#N/A"},null,null,null,null,null,null,null,null,null,null,null,null,null,null,null,null,null,null,null,null,{"$error":"#N/A"},{"$error":"#N/A"}]
[null,0,null,null,{"$error":"#N/A"},4,{"$error":"#N/A"},{"$error":"#N/A"},{"$error":"#N/A"},{"$error":"#N/A"},17,{"$error":"#N/A"},{"$error":"#N/A"},{"$error":"#N/A"},null,null,null,null,null,null,null,null,null,null,null,null,null,null,null,null,null,null,null,null,{"$error":"#N/A"},{"$error":"#N/A"}]
[null,0,null,null,{"$error":"#N/A"},4,{"$error":"#N/A"},{"$error":"#N/A"},{"$error":"#N/A"},{"$error":"#N/A"},17,{"$error":"#N/A"},{"$error":"#N/A"},{"$error":"#N/A"},null,null,null,null,null,null,null,null,null,null,null,null,null,null,null,null,null,null,null,null,{"$error":"#N/A"},{"$error":"#N/A"}]
[null,0,null,null,{"$error":"#N/A"},4,{"$error":"#N/A"},{"$error":"#N/A"},{"$error":"#N/A"},{"$error":"#N/A"},17,{"$error":"#N/A"},{"$error":"#N/A"},{"$error":"#N/A"}]
[null,null,null,null,{"$error":"#N/A"},4,{"$error":"#N/A"},{"$error":"#N/A"},{"$error":"#N/A"},{"$error":"#N/A"},17,{"$error":"#N/A"},{"$error":"#N/A"},{"$error":"#N/A"}]
[null,null,null,null,{"$error":"#N/A"},4,{"$error":"#N/A"},{"$error":"#N/A"},{"$error":"#N/A"},{"$error":"#N/A"},17,{"$error":"#N/A"},{"$error":"#N/A"},{"$error":"#N/A"}]
[null,null,null,null,{"$error":"#N/A"},4,{"$error":"#N/A"},{"$f":"IF(S39<>\" - \",VLOOKUP(S39,weapons,3,FALSE)+VLOOKUP($W39,size,3),\" \")","v":{"$error":"#N/A"}},{"$error":"#N/A"},{"$error":"#N/A"},17,{"$error":"#N/A"},{"$error":"#N/A"},{"$error":"#N/A"}]

{"sheet":"Encounter","index":8,"n_rows":67,"n_cols":43,"rows_kept":67,"cut":false,"hidden":false,"merged":[[0,25,0,30],[0,14,0,15],[0,20,0,21],[0,0,1,0],[0,1,1,1],[0,2,1,2],[0,3,1,3],[0,9,0,10]]}
["Special","Save","SP","Creature","Atk","Dmg \nbonus","Damage \nLevel",null,null,"Defence",null,"Absorb",null,null,"Armour",null,"Attack","Attack","Attack","Attack","Health",null,"Size",null,null,"Attributes",null,null,null,null,null,"Flying\nclass","Ability","No.","Exp","Total Exp","Hero points"]
[null,null,null,null,null,null,"Dmg","Dmg","Dmg","Parry","Range","Cut","Thrust","Chop","Body","Shield","Type","Weapon",null,null,"SP","WP","feet","HD","Skill","Str","Int","Will","Con","Dex","Alert",null,null,null,null,null,null,"Weapon","Body Armour","Breast Plate"]
[null,null,null,null,null,null,null,null,null,null,null,null,null,null,null,null,null,null,null,null,null,null,null,null,null,null,null,null,null,null,null,null,null,null,null,null,null," - "," - ","-"]
[null,null,null,null,{"$f":"Y4+ROUNDUP(AF4/2,0)+INT(+VLOOKUP(R4,weapons,5,FALSE)*MIN(Z4,8)+VLOOKUP(R4,weapons,6,FALSE)*(AD4+VLOOKUP(O4,body_armour,5,FALSE)))+VLOOKUP(W4,size,4)","v":{"$error":"#N/A"}},{"$f":"IF(VLOOKUP($W4,size,3)<0,0,Z4-VLOOKUP($W4,size,3))","v":0},{"$f":"VLOOKUP(VLOOKUP(R4,weapons,10,FALSE)+VLOOKUP($W4,size,3)+Y4-1,New_damage,2,FALSE)","v":{"$error":"#N/A"}},{"$f":"IF(S4<>\" - \",VLOOKUP(S4,weapons,3,FALSE)+VLOOKUP($W4,size,3),\" \")","v":{"$error":"#N/A"}},{"$error":"#N/A"},{"$f":"INT(VLOOKUP(O4,body_armour,9,FALSE)+Y4+AE4+P4+VLOOKUP(W4,size,4)+(Z4+AD4)/2+VLOOKUP(R4,weapons,9,FALSE) )","v":{"$error":"#N/A"}},{"$f":"12+P4+VLOOKUP(W4,size,5)+AF4*3","v":17},{"$f":"VLOOKUP(VLOOKUP($O4,body_armour,6,FALSE)+IF($W4>6,INT(VLOOKUP($W4,size,7)/2),0),Armour_translation,2,FALSE)","v":{"$error":"#N/A"}},{"$f":"VLOOKUP(VLOOKUP($O4,body_armour,7,FALSE)+IF($W4>6,INT(VLOOKUP($W4,size,7)/2),0),Armour_translation,2,FALSE)","v":{"$error":"#N/A"}},{"$f":"VLOOKUP(VLOOKUP($O4,body_armour,8,FALSE)+IF($W4>6,INT(VLOOKUP($W4,size,7)/2),0),Armour_translation,2,FALSE)","v":{"$error":"#N/A"}},null,null,null,null,null,null,null,null,null,null,null,null,null,null,null,null,null,null,null,null,null,null,null,"Claw","Leather","Leather"]
[null,null,{"$f":"U5","v":0},null,{"$error":"#N/A"},{"$f":"IF(VLOOKUP($W5,size,3)<0,0,Z5-VLOOKUP($W5,size,3))","v":0},{"$error":"#N/A"},{"$error":"#N/A"},{"$error":"#N/A"},{"$error":"#N/A"},17,{"$error":"#N/A"},{"$error":"#N/A"},{"$error":"#N/A"},null,null,null,null,null,null,null,null,null,null,null,null,null,null,null,null,null,null,null,null,null,null,null,"Thump","Padded","Metal"]
[null,null,0,null,{"$error":"#N/A"},{"$f":"Z6","v":0},{"$error":"#N/A"},{"$error":"#N/A"},{"$error":"#N/A"},{"$error":"#N/A"},17,{"$error":"#N/A"},{"$error":"#N/A"},{"$error":"#N/A"},null,null,null,null,null,null,null,null,null,null,null,null,null,null,null,null,null,null,null,null,null,null,null,"Bite","Scale (Leather)"]
[null,null,0,null,{"$error":"#N/A"},{"$f":"Z7","v":0},{"$error":"#N/A"},{"$error":"#N/A"},{"$error":"#N/A"},{"$error":"#N/A"},17,{"$error":"#N/A"},{"$error":"#N/A"},{"$error":"#N/A"},null,null,null,null,null,null,null,null,null,null,null,null,null,null,null,null,null,null,null,null,null,null,null,"Cleaver","Boiled Leather"]
[null,null,0,null,{"$error":"#N/A"},0,{"$error":"#N/A"},{"$error":"#N/A"},{"$error":"#N/A"},{"$error":"#N/A"},17,{"$error":"#N/A"},{"$error":"#N/A"},{"$error":"#N/A"},null,null,null,null,null,null,null,null,null,null,null,null,null,null,null,null,null,null,null,null,null,null,null,"Bow - Short","Scale (Iron)"]
[null,null,0,null,{"$error":"#N/A"},0,{"$error":"#N/A"},{"$error":"#N/A"},{"$error":"#N/A"},{"$error":"#N/A"},17,{"$error":"#N/A"},{"$error":"#N/A"},{"$error":"#N/A"},null,null,null,null,null,null,null,null,null,null,null,null,null,null,null,null,null,null,null,null,null,null,null,"Bow - Long","Mail Hauberk"]
[null,null,0,null,{"$error":"#N/A"},0,{"$error":"#N/A"},{"$error":"#N/A"},{"$error":"#N/A"},{"$error":"#N/A"},17,{"$error":"#N/A"},{"$error":"#N/A"},{"$error":"#N/A"},null,null,null,null,null,null,null,null,null,null,null,null,null,null,null,null,null,null,null,null,null,null,null,"Crossbow","Mail"]
[null,null,0,null,{"$error":"#N/A"},0,{"$error":"#N/A"},{"$error":"#N/A"},{"$error":"#N/A"},{"$error":"#N/A"},17,{"$error":"#N/A"},{"$error":"#N/A"},{"$error":"#N/A"},null,null,null,null,null,null,null,null,null,null,null,null,null,null,null,null,null,null,null,null,null,null,null,"Battle-axe","Coat of Plates"]
[null,null,0,null,{"$error":"#N/A"},0,{"$error":"#N/A"},{"$error":"#N/A"},{"$error":"#N/A"},{"$error":"#N/A"},17,{"$error":"#N/A"},{"$error":"#N/A"},{"$error":"#N/A"},null,null,null,null,null,null,null,null,null,null,null,null,null,null,null,null,null,null,null,null,null,null,null,"Battle-axe 2 hands","Plate"]
[null,null,0,null,{"$error":"#N/A"},0,{"$error":"#N/A"},{"$error":"#N/A"},{"$error":"#N/A"},{"$error":"#N/A"},17,{"$error":"#N/A"},{"$error":"#N/A"},{"$error":"#N/A"},null,null,null,null,null,null,null,null,null,null,null,null,null,null,null,null,null,null,null,null,null,null,null,"Hand Axe","Hide"]
[null,null,0,null,{"$error":"#N/A"},0,{"$error":"#N/A"},{"$error":"#N/A"},{"$error":"#N/A"},{"$error":"#N/A"},17,{"$error":"#N/A"},{"$error":"#N/A"},{"$error":"#N/A"},null,null,null,null,null,null,null,null,null,null,null,null,null,null,null,null,null,null,null,null,null,null,null,"War Hammer","Thick Hide"]
[null,null,0,null,{"$error":"#N/A"},0,{"$error":"#N/A"},{"$error":"#N/A"},{"$error":"#N/A"},{"$error":"#N/A"},17,{"$error":"#N/A"},{"$error":"#N/A"},{"$error":"#N/A"},null,null,null,null,null,null,null,null,null,null,null,null,null,null,null,null,null,null,null,null,null,null,null,"Club","Scales"]
[null,null,0,null,{"$error":"#N/A"},0,{"$error":"#N/A"},{"$error":"#N/A"},{"$error":"#N/A"},{"$error":"#N/A"},17,{"$error":"#N/A"},{"$error":"#N/A"},{"$error":"#N/A"},null,null,null,null,null,null,null,null,null,null,null,null,null,null,null,null,null,null,null,null,null,null,null,"Mace","Armoured scales"]
[null,null,0,null,{"$error":"#N/A"},0,{"$error":"#N/A"},{"$error":"#N/A"},{"$error":"#N/A"},{"$error":"#N/A"},17,{"$error":"#N/A"},{"$error":"#N/A"},{"$error":"#N/A"},null,null,null,null,null,null,null,null,null,null,null,null,null,null,null,null,null,null,null,null,null,null,null,"Morning Star","Stone scales"]
[null,null,0,null,{"$error":"#N/A"},0,{"$error":"#N/A"},{"$error":"#N/A"},{"$error":"#N/A"},{"$error":"#N/A"},17,{"$error":"#N/A"},{"$error":"#N/A"},{"$error":"#N/A"},null,null,null,null,null,null,null,null,null,null,null,null,null,null,null,null,null,null,null,null,null,null,null,"Morning Star-Flail","Dragon Scales"]
[null,null,0,null,{"$error":"#N/A"},0,{"$error":"#N/A"},{"$error":"#N/A"},{"$error":"#N/A"},{"$error":"#N/A"},17,{"$error":"#N/A"},{"$error":"#N/A"},{"$error":"#N/A"},null,null,null,null,null,null,null,null,null,null,null,null,null,null,null,null,null,null,null,null,null,null,null,"Spear","Bone"]
[null,null,null,null,{"$error":"#N/A"},0,{"$error":"#N/A"},{"$f":"IF(S20<>\" - \",VLOOKUP(S20,weapons,3,FALSE)+VLOOKUP($W20,size,3),\" \")","v":{"$error":"#N/A"}},{"$error":"#N/A"},{"$error":"#N/A"},17,{"$error":"#N/A"},{"$error":"#N/A"},{"$error":"#N/A"},null,null,null,null,null,null,null,null,null,null,null,null,null,null,null,null,null,null,null,null,null,null,null,"Spear 2 hands"]
[null,null,null,null,{"$error":"#N/A"},0,{"$error":"#N/A"},{"$error":"#N/A"},{"$error":"#N/A"},{"$error":"#N/A"},17,{"$error":"#N/A"},{"$error":"#N/A"},{"$error":"#N/A"},null,null,null,null,null,null,null,null,null,null,null,null,null,null,null,null,null,null,null,null,null,null,null,"Dagger"]
[null,null,0,null,{"$error":"#N/A"},0,{"$error":"#N/A"},{"$error":"#N/A"},{"$error":"#N/A"},{"$error":"#N/A"},17,{"$error":"#N/A"},{"$error":"#N/A"},{"$error":"#N/A"},null,null,null,null,null,null,null,null,null,null,null,null,null,null,null,null,null,null,null,null,null,null,null,"Cutlass"]
[null,null,0,null,{"$error":"#N/A"},0,{"$error":"#N/A"},{"$error":"#N/A"},{"$error":"#N/A"},{"$error":"#N/A"},17,{"$error":"#N/A"},{"$error":"#N/A"},{"$error":"#N/A"},null,null,null,null,null,null,null,null,null,null,null,null,null,null,null,null,null,null,null,null,null,null,null,"Falchion"]
[null,null,0,null,{"$error":"#N/A"},0,{"$error":"#N/A"},{"$error":"#N/A"},{"$error":"#N/A"},{"$error":"#N/A"},17,{"$error":"#N/A"},{"$error":"#N/A"},{"$error":"#N/A"},null,null,null,null,null,null,null,null,null,null,null,null,null,null,null,null,null,null,null,null,null,null,null,"Short sword"]
[null,null,0,null,{"$error":"#N/A"},0,{"$error":"#N/A"},{"$error":"#N/A"},{"$error":"#N/A"},{"$error":"#N/A"},17,{"$error":"#N/A"},{"$error":"#N/A"},{"$error":"#N/A"},null,null,null,null,null,null,null,null,null,null,null,null,null,null,null,null,null,null,null,null,null,null,null,"Scimitar"]
[null,null,0,null,{"$error":"#N/A"},0,{"$error":"#N/A"},{"$error":"#N/A"},{"$error":"#N/A"},{"$error":"#N/A"},17,{"$error":"#N/A"},{"$error":"#N/A"},{"$error":"#N/A"},null,null,null,null,null,null,null,null,null,null,null,null,null,null,null,null,null,null,null,null,null,null,null,"Arming Sword"]
[null,null,null,null,{"$error":"#N/A"},0,{"$error":"#N/A"},{"$error":"#N/A"},{"$error":"#N/A"},{"$error":"#N/A"},17,{"$error":"#N/A"},{"$error":"#N/A"},{"$error":"#N/A"},null,null,null,null,null,null,null,null,null,null,null,null,null,null,null,null,null,null,null,null,null,null,null,"Bastard Sword"]
[null,null,null,null,{"$error":"#N/A"},0,{"$error":"#N/A"},{"$error":"#N/A"},{"$error":"#N/A"},{"$error":"#N/A"},17,{"$error":"#N/A"},{"$error":"#N/A"},{"$error":"#N/A"},null,null,null,null,null,null,null,null,null,null,null,null,null,null,null,null,null,null,null,null,null,null,null,"Great Sword"]
[null,null,0,null,{"$error":"#N/A"},0,{"$error":"#N/A"},{"$error":"#N/A"},{"$error":"#N/A"},{"$error":"#N/A"},17,{"$error":"#N/A"},{"$error":"#N/A"},{"$error":"#N/A"},null,null,null,null,null,null,null,null,null,null,null,null,null,null,null,null,null,null,null,null,null,null,null,"Staff"]
[null,null,null,null,{"$error":"#N/A"},0,{"$error":"#N/A"},{"$error":"#N/A"},{"$error":"#N/A"},{"$error":"#N/A"},17,{"$error":"#N/A"},{"$error":"#N/A"},{"$error":"#N/A"},null,null,null,null,null,null,null,null,null,null,null,null,null,null,null,null,null,null,null,null,null,null,null,"Missile"]
[null,null,null,"Boat Journey",null,null,null,null,null,null,null,null,null,null,null,null,null,null,null,null,null,null,null,null,null,null,null,null,null,null,null,null,null,null,null,{"$f":"SUM(AJ32:AJ33)","v":167.3366666666667},{"$f":"AJ31/300","v":0.557788888888889}]
[">10+def=Stagger(Str)",{"$f":"ROUNDUP((X32+Y32)/2,0)","v":3},{"$f":"U32","v":46},"Ogre (small)",{"$f":"Y32+ROUNDUP(AF32/2,0)+INT(+VLOOKUP(R32,weapons,3,FALSE)*MIN(Z32,8)+VLOOKUP(R32,weapons,4,FALSE)*(AD32))+VLOOKUP(W32,size,4)","v":11},{"$f":"Z32-VLOOKUP($W32,size,3)","v":1},{"$f":"VLOOKUP(VLOOKUP(R32,weapons,6,FALSE)+VLOOKUP($W32,size,3)+Y32-1,New_damage,2,FALSE)","v":"d10 / d6"},{"$f":"IF(S32<>\" - \",VLOOKUP(S32,weapons,3,FALSE)+VLOOKUP($W32,size,3),\" \")","v":" "}," ",{"$f":"INT(VLOOKUP(O32,body_armour,5,FALSE)+Y32+AE32+P32+VLOOKUP(W32,size,6)+(Z32+AD32)/2+VLOOKUP(R32,weapons,5,FALSE)/2 )","v":10},{"$f":"12+P32+VLOOKUP(W32,size,5)+AF32*3","v":9},{"$f":"VLOOKUP(VLOOKUP($O32,body_armour,2,FALSE)+IF($W32>6,INT(VLOOKUP($W32,size,7)),0),Armour_translation,2,FALSE)","v":"3/4"},{"$f":"VLOOKUP(VLOOKUP($O32,body_armour,3,FALSE)+IF($W32>6,INT(VLOOKUP($W32,size,7)),0),Armour_translation,2,FALSE)","v":"3/4"},{"$f":"VLOOKUP(VLOOKUP($O32,body_armour,4,FALSE)+IF($W32>6,INT(VLOOKUP($W32,size,7)),0),Armour_translation,2,FALSE)","v":"1/2"},"Scale (Leather)",0,{"$f":"VLOOKUP(R32,weapons,2, FALSE)","v":"Bludgeon"},"Club"," - "," - ",{"$f":"INT(W32+X32*(4.5+AC32))+3","v":46},{"$f":"2*(W32+AC32)","v":26},9,4,2,6,-1,-1,4,-1,-3,null,"Stagger",2,{"$f":"(5+E32)*(10+VLOOKUP(R32,weapons,6,FALSE)+Y32+F32)*U32*(5+VLOOKUP(O32,body_armour,6,FALSE))/1000*VLOOKUP(AG32,Specials,3,FALSE)+VLOOKUP(AG32,Specials,2,FALSE)","v":117.45600000000002},{"$f":"AH32*AI32*VLOOKUP(AH32,Attackers,2,TRUE)","v":117.45600000000002}]
["Neurotoxin (15)",{"$f":"ROUNDUP((X33+Y33)/2,0)","v":5},{"$f":"U33","v":71},"Giant Cobra",{"$f":"Y33+ROUNDUP(AF33/2,0)+INT(+VLOOKUP(R33,weapons,3,FALSE)*MIN(Z33,8)+VLOOKUP(R33,weapons,4,FALSE)*(AD33))+VLOOKUP(W33,size,4)","v":8},{"$f":"Z33-VLOOKUP($W33,size,3)","v":4},{"$f":"VLOOKUP(VLOOKUP(R33,weapons,6,FALSE)+VLOOKUP($W33,size,3)+Y33-1,New_damage,2,FALSE)","v":"d12 / d10"},{"$f":"IF(S33<>\" - \",VLOOKUP(S33,weapons,3,FALSE)+VLOOKUP($W33,size,3),\" \")","v":" "},{"$f":"IF(T33<>\" - \",VLOOKUP(T33,weapons,3,FALSE)+VLOOKUP($W33,size,3),\" \")","v":" "},{"$f":"INT(VLOOKUP(O33,body_armour,5,FALSE)+Y33+AE33+P33+VLOOKUP(W33,size,6)+(Z33+AD33)/2+VLOOKUP(R33,weapons,5,FALSE)/2 )","v":22},{"$f":"12+P33+VLOOKUP(W33,size,5)+AF33*3","v":9},{"$f":"VLOOKUP(VLOOKUP($O33,body_armour,2,FALSE)+IF($W33>6,INT(VLOOKUP($W33,size,7)),0),Armour_translation,2,FALSE)","v":"3/4"},{"$f":"VLOOKUP(VLOOKUP($O33,body_armour,3,FALSE)+IF($W33>6,INT(VLOOKUP($W33,size,7)),0),Armour_translation,2,FALSE)","v":1},{"$f":"VLOOKUP(VLOOKUP($O33,body_armour,4,FALSE)+IF($W33>6,INT(VLOOKUP($W33,size,7)),0),Armour_translation,2,FALSE)","v":1},"Scales",0,{"$f":"VLOOKUP(R33,weapons,2, FALSE)","v":"Pierce"},"Bite"," - "," - ",{"$f":"INT(W33+X33*(4.5+AC33))-2","v":71},{"$f":"2*(W33+AC33)","v":32},10,6,3,9,-3,-2,6,2,2,null,"Poison",1,{"$f":"(5+E33)*(10+VLOOKUP(R33,weapons,6,FALSE)+Y33+F33)*U33*(5+VLOOKUP(O33,body_armour,6,FALSE))/1000*VLOOKUP(AG33,Specials,3,FALSE)+VLOOKUP(AG33,Specials,2,FALSE)","v":199.52266666666671},{"$f":"AH33*AI33*VLOOKUP(AH33,Attackers,2,TRUE)","v":49.880666666666677}]
[null,{"$f":"ROUNDUP((X34+Y34)/2,0)","v":2},{"$f":"U34","v":14},"Seaman",{"$f":"Y34+ROUNDUP(AF34/2,0)+INT(+VLOOKUP(R34,weapons,3,FALSE)*MIN(Z34,8)+VLOOKUP(R34,weapons,4,FALSE)*(AD34))+VLOOKUP(W34,size,4)","v":3},{"$f":"Z34-VLOOKUP($W34,size,3)","v":1},{"$f":"VLOOKUP(VLOOKUP(R34,weapons,6,FALSE)+VLOOKUP($W34,size,3)+Y34-1,New_damage,2,FALSE)","v":"d6 / d4"}," "," ",{"$f":"INT(VLOOKUP(O34,body_armour,5,FALSE)+Y34+AE34+P34+VLOOKUP(W34,size,6)+(Z34+AD34)/2+VLOOKUP(R34,weapons,5,FALSE)/2 )","v":12},12,{"$f":"VLOOKUP(VLOOKUP($O34,body_armour,2,FALSE)+IF($W34>6,INT(VLOOKUP($W34,size,7)),0),Armour_translation,2,FALSE)","v":1},{"$f":"VLOOKUP(VLOOKUP($O34,body_armour,3,FALSE)+IF($W34>6,INT(VLOOKUP($W34,size,7)),0),Armour_translation,2,FALSE)","v":1.5},{"$f":"VLOOKUP(VLOOKUP($O34,body_armour,4,FALSE)+IF($W34>6,INT(VLOOKUP($W34,size,7)),0),Armour_translation,2,FALSE)","v":1.5},"Leather",0,{"$f":"VLOOKUP(R34,weapons,2, FALSE)","v":"Chop"},"Cutlass"," - "," - ",{"$f":"INT(W34+X34*(4.5+AC34))+3","v":14},{"$f":"2*(W34+AC34)","v":14},6,1,2,1,-1,0,1,0,0,null,null,0,{"$f":"(5+E34)*(10+VLOOKUP(R34,weapons,6,FALSE)+Y34+F34)*U34*(5+VLOOKUP(O34,body_armour,6,FALSE))/1000*VLOOKUP(AG34,Specials,3,FALSE)+VLOOKUP(AG34,Specials,2,FALSE)","v":17.389866666666666},{"$f":"AH34*AI34*VLOOKUP(AH34,Attackers,2,TRUE)","v":0}]
[null,{"$f":"ROUNDUP((X35+Y35)/2,0)","v":4},{"$f":"U35","v":25},"Captain",{"$f":"Y35+ROUNDUP(AF35/2,0)+INT(+VLOOKUP(R35,weapons,3,FALSE)*MIN(Z35,8)+VLOOKUP(R35,weapons,4,FALSE)*(AD35))+VLOOKUP(W35,size,4)","v":5},{"$f":"Z35-VLOOKUP($W35,size,3)","v":1},{"$f":"VLOOKUP(VLOOKUP(R35,weapons,6,FALSE)+VLOOKUP($W35,size,3)+Y35-1,New_damage,2,FALSE)","v":"d10 / d6"}," "," ",{"$f":"INT(VLOOKUP(O35,body_armour,5,FALSE)+Y35+AE35+P35+VLOOKUP(W35,size,6)+(Z35+AD35)/2+VLOOKUP(R35,weapons,5,FALSE)/2 )","v":16},12,{"$f":"VLOOKUP(VLOOKUP($O35,body_armour,2,FALSE)+IF($W35>6,INT(VLOOKUP($W35,size,7)),0),Armour_translation,2,FALSE)","v":1},{"$f":"VLOOKUP(VLOOKUP($O35,body_armour,3,FALSE)+IF($W35>6,INT(VLOOKUP($W35,size,7)),0),Armour_translation,2,FALSE)","v":1.5},{"$f":"VLOOKUP(VLOOKUP($O35,body_armour,4,FALSE)+IF($W35>6,INT(VLOOKUP($W35,size,7)),0),Armour_translation,2,FALSE)","v":1.5},"Leather",0,{"$f":"VLOOKUP(R35,weapons,2, FALSE)","v":"Slash"},"Arming Sword"," - "," - ",{"$f":"INT(W35+X35*(4.5+AC35))+3","v":25},{"$f":"2*(W35+AC35)","v":14},6,3,4,1,-1,0,1,1,1,null,null,0,{"$f":"(5+E35)*(10+VLOOKUP(R35,weapons,6,FALSE)+Y35+F35)*U35*(5+VLOOKUP(O35,body_armour,6,FALSE))/1000*VLOOKUP(AG35,Specials,3,FALSE)+VLOOKUP(AG35,Specials,2,FALSE)","v":45.666666666666664},{"$f":"AH35*AI35*VLOOKUP(AH35,Attackers,2,TRUE)","v":0}]
[null,null,null,"Saltmarsh",null,null,null,null,null,null,null,null,null,null,null,null,null,null,null,null,null,null,null,null,null,null,null,null,null,null,null,null,null,null,null,{"$f":"SUM(AJ37:AJ42)","v":1031.2280000000001},{"$f":"AJ36/300","v":3.4374266666666671}]
[null,{"$f":"ROUNDUP((X37+Y37)/2,0)","v":2},{"$f":"U37","v":20},"Smuggler",{"$f":"Y37+ROUNDUP(AF37/2,0)+INT(+VLOOKUP(R37,weapons,3,FALSE)*MIN(Z37,8)+VLOOKUP(R37,weapons,4,FALSE)*(AD37))+VLOOKUP(W37,size,4)","v":3},{"$f":"Z37-VLOOKUP($W37,size,3)","v":1},{"$f":"VLOOKUP(VLOOKUP(R37,weapons,6,FALSE)+VLOOKUP($W37,size,3)+Y37-1,New_damage,2,FALSE)","v":"d6 / d4"},{"$f":"IF(S37<>\" - \",VLOOKUP(S37,weapons,3,FALSE)+VLOOKUP($W37,size,3),\" \")","v":" "},{"$f":"IF(T37<>\" - \",VLOOKUP(T37,weapons,3,FALSE)+VLOOKUP($W37,size,3),\" \")","v":" "},{"$f":"INT(VLOOKUP(O37,body_armour,5,FALSE)+Y37+AE37+P37+VLOOKUP(W37,size,6)+(Z37+AD37)/2+VLOOKUP(R37,weapons,5,FALSE)/2 )","v":12},{"$f":"12+P37+VLOOKUP(W37,size,5)+AF37*3","v":12},{"$f":"VLOOKUP(VLOOKUP($O37,body_armour,2,FALSE)+IF($W37>6,INT(VLOOKUP($W37,size,7)),0),Armour_translation,2,FALSE)","v":"3/4"},{"$f":"VLOOKUP(VLOOKUP($O37,body_armour,3,FALSE)+IF($W37>6,INT(VLOOKUP($W37,size,7)),0),Armour_translation,2,FALSE)","v":1},{"$f":"VLOOKUP(VLOOKUP($O37,body_armour,4,FALSE)+IF($W37>6,INT(VLOOKUP($W37,size,7)),0),Armour_translation,2,FALSE)","v":"3/4"},"Boiled Leather",0,{"$f":"VLOOKUP(R37,weapons,2, FALSE)","v":"Pierce"},"Short sword"," - "," - ",{"$f":"INT(W37+X37*(4.5+AC37))+3","v":20},{"$f":"2*(W37+AC37)","v":14},6,2,2,1,-1,-1,1,2,1,null,null,16,{"$f":"(5+E37)*(10+VLOOKUP(R37,weapons,6,FALSE)+Y37+F37)*U37*(5+VLOOKUP(O37,body_armour,6,FALSE))/1000*VLOOKUP(AG37,Specials,3,FALSE)+VLOOKUP(AG37,Specials,2,FALSE)","v":27.38133333333333},{"$f":"AH37*AI37*VLOOKUP(AH37,Attackers,2,TRUE)","v":525.72159999999997}]
[null,{"$f":"ROUNDUP((X38+Y38)/2,0)","v":4},31,"Mate / Bosun",5,2,"d10 / d8"," "," ",14,12,"3/4",1,"3/4","Boiled Leather",0,"Slash","Scimitar"," - "," - ",31,14,6,4,4,2,-1,0,1,0,2,null,null,-1,68.654666666666671,68.654666666666671]
[null,{"$f":"ROUNDUP((X39+Y39)/2,0)","v":6},48,"Captain",7,3,"2d12"," "," ",16,12,"1/4","1/2","3/4","Mail Hauberk",0,"Slash","Scimitar"," - "," - ",48,16,6,6,6,3,1,1,2,0,2,null,null,-1,166.08,166.08]
[null,{"$f":"ROUNDUP((X40+Y40)/2,0)","v":2},14,"Lizardman",5,4,"d10 / d6"," "," ",18,12,1,1.5,1.5,"Leather",0,"Pierce","Spear 2 hands"," - "," - ",14,14,6,1,3,4,1,0,1,2,1,null,null,4,29.409333333333333,117.63733333333333]
[null,{"$f":"VLOOKUP(X41,Save,2,FALSE)","v":2},22,"Snablet",1,-1,"d4"," "," ",11,12,1,1.5,1.5,"Leather",0,"Bludgeon","Club"," - "," - ",22,12,6,3,2,-1,2,1,0,1,2,null,"Mage 3",-1,75.672799999999995,75.672799999999995]
[null,{"$f":"VLOOKUP(X42,Save,2,FALSE)","v":3},23,"Punketah",1,-1,"d4"," "," ",10,12,1,1,"3/4","Scale (Leather)",0,"Bludgeon","Club"," - "," - ",23,10,6,4,2,-1,3,0,-1,2,2,null,"Mage 3",-1,77.461600000000004,77.461600000000004]
[null,{"$f":"ROUNDUP((X43+Y43)/2,0)","v":3},21,"Gnoll",7,2,"2d12"," "," ",11,11,"1/4","1/3","1/2","Coat of Plates",0,{"$f":"VLOOKUP(R43,weapons,2, FALSE)","v":"Slash"},"Battle-axe 2 hands"," - "," - ",21,{"$f":"2*(W43+AC43)","v":16},7,2,3,3,-1,0,1,0,0,null,null,4,70.711199999999991,282.84479999999996]
["Poison",{"$f":"ROUNDUP((X44+Y44)/2,0)","v":2},10,"Spider",6,3,"d3"," "," ",15,14,2,2,2," - ",0,"Pierce","Bite"," - "," - ",{"$f":"INT(W44+X44*(4.5+AC44))-2","v":10},6,3,2,2,1,-3,-2,0,6,3,null,"poison",-1,27.423999999999999,27.423999999999999]
[null,{"$f":"ROUNDUP((X45+Y45)/2,0)","v":2},5,"Stirge",6,1,"d4"," "," ",12,23,2,2,2," - ",0,"Pierce","Bite"," - "," - ",{"$f":"INT(W45+X45*(4.5+AC45))-2","v":5},6,3,1,3,-1,-1,0,0,3,1,3,null,6,7.48,53.856000000000002]
[null,{"$f":"VLOOKUP(X46,Save,2,FALSE)","v":2},{"$f":"U46","v":22},"Snablet",{"$f":"Y46+ROUNDUP(AF46/2,0)+INT(+VLOOKUP(R46,weapons,3,FALSE)*MIN(Z46,8)+VLOOKUP(R46,weapons,4,FALSE)*(AD46))+VLOOKUP(W46,size,4)","v":1},{"$f":"Z46-VLOOKUP($W46,size,3)","v":-1},{"$f":"VLOOKUP(VLOOKUP(R46,weapons,6,FALSE)+VLOOKUP($W46,size,3)+Y46-1,New_damage,2,FALSE)","v":"d4"},{"$f":"IF(S46<>\" - \",VLOOKUP(S46,weapons,3,FALSE)+VLOOKUP($W46,size,3),\" \")","v":" "}," ",{"$f":"INT(VLOOKUP(O46,body_armour,5,FALSE)+Y46+AE46+P46+VLOOKUP(W46,size,6)+(Z46+AD46)/2+VLOOKUP(R46,weapons,5,FALSE)/2 )","v":11},{"$f":"12+P46+VLOOKUP(W46,size,5)+AF46*3","v":12},{"$f":"VLOOKUP(VLOOKUP($O46,body_armour,2,FALSE)+IF($W46>6,INT(VLOOKUP($W46,size,7)),0),Armour_translation,2,FALSE)","v":1},{"$f":"VLOOKUP(VLOOKUP($O46,body_armour,3,FALSE)+IF($W46>6,INT(VLOOKUP($W46,size,7)),0),Armour_translation,2,FALSE)","v":1.5},{"$f":"VLOOKUP(VLOOKUP($O46,body_armour,4,FALSE)+IF($W46>6,INT(VLOOKUP($W46,size,7)),0),Armour_translation,2,FALSE)","v":1.5},"Leather",0,"Bludgeon","Club"," - "," - ",{"$f":"INT(W46+X46*(4.5+AC46))+3","v":22},12,6,3,2,-1,2,1,0,1,2,null,"Mage 2",-1,{"$f":"(5+E46)*(10+VLOOKUP(R46,weapons,6,FALSE)+Y46+F46)*U46*(5+VLOOKUP(O46,body_armour,6,FALSE))/1000*VLOOKUP(AG46,Specials,3,FALSE)+VLOOKUP(AG46,Specials,2,FALSE)","v":45.672799999999995},{"$f":"AH46*AI46*VLOOKUP(AH46,Attackers,2,TRUE)","v":45.672799999999995}]
[null,{"$f":"VLOOKUP(X47,Save,2,FALSE)","v":3},{"$f":"U47","v":23},"Punketah",{"$f":"Y47+ROUNDUP(AF47/2,0)+INT(+VLOOKUP(R47,weapons,3,FALSE)*MIN(Z47,8)+VLOOKUP(R47,weapons,4,FALSE)*(AD47))+VLOOKUP(W47,size,4)","v":1},{"$f":"Z47-VLOOKUP($W47,size,3)","v":-1},{"$f":"VLOOKUP(VLOOKUP(R47,weapons,6,FALSE)+VLOOKUP($W47,size,3)+Y47-1,New_damage,2,FALSE)","v":"d4"}," "," ",{"$f":"INT(VLOOKUP(O47,body_armour,5,FALSE)+Y47+AE47+P47+VLOOKUP(W47,size,6)+(Z47+AD47)/2+VLOOKUP(R47,weapons,5,FALSE)/2 )","v":10},{"$f":"12+P47+VLOOKUP(W47,size,5)+AF47*3","v":12},{"$f":"VLOOKUP(VLOOKUP($O47,body_armour,2,FALSE)+IF($W47>6,INT(VLOOKUP($W47,size,7)),0),Armour_translation,2,FALSE)","v":1},{"$f":"VLOOKUP(VLOOKUP($O47,body_armour,3,FALSE)+IF($W47>6,INT(VLOOKUP($W47,size,7)),0),Armour_translation,2,FALSE)","v":1},{"$f":"VLOOKUP(VLOOKUP($O47,body_armour,4,FALSE)+IF($W47>6,INT(VLOOKUP($W47,size,7)),0),Armour_translation,2,FALSE)","v":"3/4"},"Scale (Leather)",0,"Bludgeon","Club"," - "," - ",{"$f":"INT(W47+X47*(4.5+AC47))+3","v":23},10,6,4,2,-1,3,0,-1,2,2,null,"Mage 3",-1,77.461600000000004,77.461600000000004]
[null,null,null,"Ned",{"$f":"Y48+ROUNDUP(AF48/2,0)+INT(+VLOOKUP(R48,weapons,3,FALSE)*MIN(Z48,8)+VLOOKUP(R48,weapons,4,FALSE)*(AD48))+VLOOKUP(W48,size,4)","v":2},{"$f":"Z48-VLOOKUP($W48,size,3)","v":0},{"$f":"VLOOKUP(VLOOKUP(R48,weapons,6,FALSE)+VLOOKUP($W48,size,3)+Y48-1,New_damage,2,FALSE)","v":"d4"}," "," ",{"$f":"INT(VLOOKUP(O48,body_armour,5,FALSE)+Y48+AE48+P48+VLOOKUP(W48,size,6)+(Z48+AD48)/2+VLOOKUP(R48,weapons,5,FALSE)/2 )","v":13},{"$f":"12+P48+VLOOKUP(W48,size,5)+AF48*3","v":12},{"$f":"VLOOKUP(VLOOKUP($O48,body_armour,2,FALSE)+IF($W48>6,INT(VLOOKUP($W48,size,7)),0),Armour_translation,2,FALSE)","v":2},{"$f":"VLOOKUP(VLOOKUP($O48,body_armour,3,FALSE)+IF($W48>6,INT(VLOOKUP($W48,size,7)),0),Armour_translation,2,FALSE)","v":2},{"$f":"VLOOKUP(VLOOKUP($O48,body_armour,4,FALSE)+IF($W48>6,INT(VLOOKUP($W48,size,7)),0),Armour_translation,2,FALSE)","v":2}," - ",0,"Bludgeon","Club"," - "," - ",{"$f":"INT(W48+X48*(4.5+AC48))+3","v":25},14,6,3,2,0,-1,0,1,2,2,null,null,-1,19.600000000000001,19.600000000000001]
[null,null,null,"Belreeve",null,null,null,null,null,null,null,null,null,null,null,null,null,null,null,null,null,null,null,null,null,null,null,null,null,null,null,null,null,null,null,{"$f":"SUM(AJ50:AJ58)","v":593.11023333333333},{"$f":"AJ49/300","v":1.9770341111111112}]
["Mage PP=7",{"$f":"VLOOKUP(X50,Save,2,FALSE)","v":2},{"$f":"U50","v":19},"Belreeve",{"$f":"Y50+ROUNDUP(AF50/2,0)+INT(+VLOOKUP(R50,weapons,3,FALSE)*MIN(Z50,8)+VLOOKUP(R50,weapons,4,FALSE)*(AD50))+VLOOKUP(W50,size,4)","v":3},{"$f":"Z50-VLOOKUP($W50,size,3)","v":-1},{"$f":"VLOOKUP(VLOOKUP(R50,weapons,6,FALSE)+VLOOKUP($W50,size,3)+Y50-1,New_damage,2,FALSE)","v":"2d4"},{"$f":"IF(S50<>\" - \",VLOOKUP(S50,weapons,3,FALSE)+VLOOKUP($W50,size,3),\" \")","v":" "},{"$f":"IF(T50<>\" - \",VLOOKUP(T50,weapons,3,FALSE)+VLOOKUP($W50,size,3),\" \")","v":" "},{"$f":"INT(VLOOKUP(O50,body_armour,5,FALSE)+Y50+AE50+P50+VLOOKUP(W50,size,6)+(Z50+AD50)/2+VLOOKUP(R50,weapons,5,FALSE)/2 )","v":13},{"$f":"12+P50+VLOOKUP(W50,size,5)+AF50*3","v":12},{"$f":"VLOOKUP(VLOOKUP($O50,body_armour,2,FALSE)+IF($W50>6,INT(VLOOKUP($W50,size,7)),0),Armour_translation,2,FALSE)","v":2},{"$f":"VLOOKUP(VLOOKUP($O50,body_armour,3,FALSE)+IF($W50>6,INT(VLOOKUP($W50,size,7)),0),Armour_translation,2,FALSE)","v":2},{"$f":"VLOOKUP(VLOOKUP($O50,body_armour,4,FALSE)+IF($W50>6,INT(VLOOKUP($W50,size,7)),0),Armour_translation,2,FALSE)","v":2}," - ",null,{"$f":"VLOOKUP(R50,weapons,2, FALSE)","v":"Bludgeon"},"Staff"," - "," - ",{"$f":"INT(W50+X50*(4.5+AC50))+3","v":19},{"$f":"2*(W50+AC50)","v":10},6,3,1,-1,2,1,-1,2,1,null,"Mage 2",-1,{"$f":"(5+E50)*(10+VLOOKUP(R50,weapons,6,FALSE)+Y50+F50)*U50*(5+VLOOKUP(O50,body_armour,6,FALSE))/1000*VLOOKUP(AG50,Specials,3,FALSE)+VLOOKUP(AG50,Specials,2,FALSE)","v":47.024000000000001},47.024000000000001]
[null,{"$f":"VLOOKUP(X51,Save,2,FALSE)","v":3},37,"Slumper",8,-1,"d10 / d6"," "," ",10,10,"1/4","1/3","1/2","Thick Hide",null,{"$f":"VLOOKUP(R51,weapons,2, FALSE)","v":"Bludgeon"},"Club"," - "," - ",37,20,8,4,4,2,-2,-2,2,0,-2,null,null,-1,82.251000000000005,82.251000000000005]
[null,{"$f":"ROUNDUP((X52+Y52)/2,0)","v":2},9,"Goblin",2,3,"2d4"," "," ",15,16,"3/4",1,"3/4","Boiled Leather",3,{"$f":"VLOOKUP(R52,weapons,2, FALSE)","v":"Pierce"},"Short sword"," - "," - ",9,8,4,0.5,2,2,-1,-1,0,1,2,null,null,10,12.049799999999999,144.59759999999997]
[null,1,9,"Goblin - archer",3,2,"d4"," "," ",12,13,1,1,1,"Padded",0,"Pierce","Bow - Short"," - "," - ",9,8,4,0.5,1,1,-1,-1,0,3,2,null,null,2,11.750399999999999,11.750399999999999]
[null,1,4,"Giant Bats",5,2,"d2"," "," ",12,27,1,1.5,1.5,"Leather",0,"Pierce","Bite"," - "," - ",{"$f":"INT(W54+X54*(4.5+AC54))-2","v":4},4,2,1,1,0,-2,-2,0,3,3,4,null,6,5.8453333333333326,42.08639999999999]
[null,4,23,"Goblin - leader",5,4,"d8 / d6"," "," ",16,16,"1/4","1/2","3/4","Mail Hauberk",3,"Bludgeon","Morning Star-Flail"," - "," - ",{"$f":"INT(W55+X55*(4.5+AC55))+3","v":23},10,4,3,4,3,-1,0,1,2,2,null,null,-1,61.011333333333333,61.011333333333333]
[null,2,21,"HobGoblin",5,3,"d6 / d4"," "," ",15,15,"3/4",1,"3/4","Boiled Leather",3,"Pierce","Morning Star"," - "," - ",21,14,5,2,2,3,-1,-1,2,1,2,null,null,3,40.165999999999997,90.373499999999993]
[null,2,{"$f":"U57","v":14},"Skeleton",3,0,"2d4"," "," ",15,14,2,2,2," - ",2,"Chop","Cleaver"," - "," - ",{"$f":"INT(W57+X57*(4.5+AC57))+3","v":14},14,6,1,2,0,{"$f":"--2","v":2},0,1,2,0,null,null,6,13.44,96.768000000000001,null,-3,4,null,"Claw","Leather","Leather"]
[null,2,{"$f":"U58","v":22},"Zombie",0,2,"d4"," "," ",7,12,1,1,1,"Hide",0,"Chop","Cleaver"," - "," - ",{"$f":"INT(W58+X58*(4.5+AC58))+3","v":22},16,6,2,1,2,-3,-2,2,-3,-2,null,null,2,17.248000000000001,{"$f":"AH58*AI58*VLOOKUP(AH58,Attackers,2,TRUE)","v":17.248000000000001}]
[null,null,null,"Parnassus",null,null,null,null,null,null,null,null,null,null,null,null,null,null,null,null,null,null,null,null,null,null,null,null,null,null,null,null,null,null,null,{"$f":"SUM(AJ60:AJ67)","v":1151.6857299999999},{"$f":"AJ59/300","v":3.8389524333333331}]
[null,{"$f":"ROUNDUP((X60+Y60)/2,0)","v":2},{"$f":"U60","v":14},"Skeleton",{"$f":"Y60+ROUNDUP(AF60/2,0)+INT(+VLOOKUP(R60,weapons,3,FALSE)*MIN(Z60,8)+VLOOKUP(R60,weapons,4,FALSE)*(AD60))+VLOOKUP(W60,size,4)","v":3},{"$f":"Z60-VLOOKUP($W60,size,3)","v":0},{"$f":"VLOOKUP(VLOOKUP(R60,weapons,6,FALSE)+VLOOKUP($W60,size,3)+Y60-1,New_damage,2,FALSE)","v":"2d4"},{"$f":"IF(S60<>\" - \",VLOOKUP(S60,weapons,3,FALSE)+VLOOKUP($W60,size,3),\" \")","v":" "},{"$f":"IF(T60<>\" - \",VLOOKUP(T60,weapons,3,FALSE)+VLOOKUP($W60,size,3),\" \")","v":" "},{"$f":"INT(VLOOKUP(O60,body_armour,5,FALSE)+Y60+AE60+P60+VLOOKUP(W60,size,6)+(Z60+AD60)/2+VLOOKUP(R60,weapons,5,FALSE)/2 )","v":15},{"$f":"12+P60+VLOOKUP(W60,size,5)+AF60*3","v":14},{"$f":"VLOOKUP(VLOOKUP($O60,body_armour,2,FALSE)+IF($W60>6,INT(VLOOKUP($W60,size,7)),0),Armour_translation,2,FALSE)","v":2},{"$f":"VLOOKUP(VLOOKUP($O60,body_armour,3,FALSE)+IF($W60>6,INT(VLOOKUP($W60,size,7)),0),Armour_translation,2,FALSE)","v":2},{"$f":"VLOOKUP(VLOOKUP($O60,body_armour,4,FALSE)+IF($W60>6,INT(VLOOKUP($W60,size,7)),0),Armour_translation,2,FALSE)","v":2}," - ",2,{"$f":"VLOOKUP(R60,weapons,2, FALSE)","v":"Chop"},"Cleaver"," - "," - ",{"$f":"INT(W60+X60*(4.5+AC60))+3","v":14},{"$f":"2*(W60+AC60)","v":14},6,1,2,0,{"$f":"--2","v":2},0,1,2,0,null,null,7,{"$f":"(5+E60)*(10+VLOOKUP(R60,weapons,6,FALSE)+Y60+F60)*U60*(5+VLOOKUP(O60,body_armour,6,FALSE))/1000*VLOOKUP(AG60,Specials,3,FALSE)+VLOOKUP(AG60,Specials,2,FALSE)","v":13.44},{"$f":"AH60*AI60*VLOOKUP(AH60,Attackers,2,TRUE)","v":112.896},null,-3,4,null,"Claw","Leather","Leather"]
[null,{"$f":"ROUNDUP((X61+Y61)/2,0)","v":2},{"$f":"U61","v":22},"Zombie",0,2,"d4"," "," ",7,12,1,1,1,"Hide",0,"Chop","Cleaver"," - "," - ",22,16,6,2,1,2,-3,-2,2,-3,-2,null,null,7,17.248000000000001,144.88319999999999]
[null,{"$f":"ROUNDUP((X62+Y62)/2,0)","v":2},{"$f":"U62","v":9},"Goblin",2,3,"2d4"," "," ",15,16,"3/4",1,"3/4","Boiled Leather",3,"Pierce","Short sword"," - "," - ",9,8,4,0.5,2,2,-1,-1,0,1,2,null,null,6,12.049799999999999,86.758560000000003]
[null,{"$f":"ROUNDUP((X63+Y63)/2,0)","v":2},{"$f":"U63","v":18},"BugBear",7,5,"d6 / d4"," "," ",13,14,1,1,"3/4","Scale (Leather)",2,"Pierce","Morning Star"," - "," - ",18,12,6,2,2,5,1,-2,0,1,0,null,null,3,44.150400000000005,99.338400000000021,null,8,29,null,"Battle-axe 2 hands","Hide"]
[null,{"$f":"ROUNDUP((X64+Y64)/2,0)","v":2},{"$f":"U64","v":21},"HobGoblin",5,3,"d6 / d4"," "," ",15,15,"3/4",1,"3/4","Boiled Leather",3,"Pierce","Morning Star"," - "," - ",21,14,5,2,2,3,-1,-1,2,1,2,null,null,3,40.165999999999997,90.373499999999993]
[null,{"$f":"VLOOKUP(X65,Save,2,FALSE)","v":3},15,"Abomination",11,2,"d10 / d6"," "," ",12,10,"1/4","1/3","1/2","Thick Hide",null,"Bludgeon","Club"," - "," - ",37,20,8,4,4,5,-2,-2,2,0,-2,null,null,2,121.47840000000001,121.47840000000001]
["Necro",{"$f":"ROUNDUP((X66+Y66)/2,0)","v":2},10,"Necromancer",2,-2,"d4",{"$error":"#N/A"},{"$error":"#N/A"},11,12,1,1.5,1.5,"Leather",null,"Pierce","Dagger",null,null,18,20,6,2,1,-2,3,0,0,1,2,null,"Priest 3",6,63.809599999999996,459.42911999999995]
["Necro",{"$f":"ROUNDUP((X67+Y67)/2,0)","v":3},26,"Parnassus",6,2,"d8 / d6",{"$error":"#N/A"},{"$error":"#N/A"},19,10,"3/4",1,1,"Leather",null,"Pierce","Dagger",null,null,27,21,8,3,2,5,4,1,1,2,3,null,"Priest 4",1,146.11419999999998,36.528549999999996]

{"sheet":"Hero Points","index":9,"n_rows":33,"n_cols":7,"rows_kept":33,"cut":false,"hidden":false,"merged":[]}
["Tizun Thane",null,"Kugnar","Desairy","Gleb","Thrud","Frank"]
["Monsters",31]
["Investigation of farmhouses",1]
["Canyon rocks",1,null,1]
["Iron Golem/ getting in",1,null,null,1,1]
["Tizun's ring",2]
["Sleep gas",2]
["Nandies",1]
["Fireplace climbing / escape",null,null,null,1]
["Carbuncle",null,1,null,1]
["Almost finding treasure",null,null,1]
["Final Battle"]
["Completing Adventure",5]
[null,{"$f":"SUM(B2:B13)","v":44},{"$f":"SUM(C3:C13)+$B14","v":45},{"$f":"SUM(D3:D13)+$B14","v":46},{"$f":"SUM(E3:E13)+$B14","v":47},{"$f":"SUM(F3:F13)+$B14","v":45},{"$f":"(SUM(G3:G13)+$B14)*1.1","v":48.400000000000006}]
[]
[]
[]
[null,"All","Orik","Hussk","Crusty","Faith","Hazel"]
["Belreeve"]
["Monsters",32]
["Roleplaying",null,2,2,4,2,2]
["Money Incedent",null,null,null,1,null,1]
["Goblin Tree",null,null,null,null,1]
["Goblin leader+Guards",null,1,null,null,null,1]
["Strategy",null,null,null,1,1]
["Puzzle Room",null,1,1]
["Completing Adventure",5]
[null,null,{"$f":"B20+B27+C21+C24+C26-C30","v":40},{"$f":"B20+B27+D21+D26+D31","v":41},{"$f":"B20+B27+E21+E22+E25+E31","v":44},{"$f":"B20+B27+F21+F23+F25+F31-4","v":38},{"$f":"B20+B27+G21+G22+G24-4","v":37}]
[]
["Slowing Down",null,1]
["Focus",null,null,1,1,1]
[]
["Gold",615,123,123,123,123,123]

{"sheet":"Tables","index":10,"n_rows":134,"n_cols":18,"rows_kept":134,"cut":false,"hidden":false,"merged":[]}
[null,null,null,null,"Natural weapons get bigger too"]
[1,2,3,4,5,6,7]
[null,null,null,null,"Weapon",null,null,null,"lbs/stone",14]
["Weapon","Type","Strength","Dexterity","To hit bonus","Damage level","Lookup value","Missile","stones",13]
[" - ","Slash",0,0,-1,1,{"$f":"VLOOKUP(F5,New_damage,2,FALSE)","v":"d2"},1,"lbs/stone",{"$f":"J3*J4","v":182}]
["Claw","Slash",0,1,-1,2,"d3",1]
["Thump","Bludgeon",0,1,-1,1,"d2",1,"height","Strength"]
["Bite","Pierce",0,1,-2,3,"d4",1,7,{"$f":"POWER(I8/6,2.5)+3","v":4.470168028805487}]
["Hug","Bludgeon",0.5,0.5,-2,4,"2d4",1]
["Cleaver","Chop",0.5,0.5,0,3,"d4",1]
["Bow - Short","Pierce",0,1,1,4,"2d4",0]
["Bow - Long","Pierce",0,1,1,6,"d8 / d4",0]
["Crossbow","Pierce",0,1,4,5,"d6 / d4",0]
["Missile","Bludgeon",0,1,-2,1,"d2",0]
["Battle-axe","Slash",1,0,-1,5,"d6 / d4",1]
["Battle-axe 2 hands","Slash",1,0,-1,8,"d10 / d6",1]
["Poll axe","Bludgeon",0.5,0.5,2,8,"d10 / d6",1]
["Hand Axe","Slash",0,1,-3,4,"2d4",1]
["War Hammer","Bludgeon",1,0,-1,5,"d6 / d4",1]
["Club","Bludgeon",1,0,-3,2,"d3",1]
["Mace","Bludgeon",1,0,-2,4,"2d4",1]
["Morning Star","Pierce",1,0,-2,4,"2d4",1]
["Morning Star Great","Pierce",1,0,0,7,"d8 / d6",1]
["Morning Star-Flail","Bludgeon",0,1,-1,5,"d6 / d4",1]
["Spear","Pierce",0,1,4,3,"d4",1]
["Spear 2 hands","Pierce",0,1,4,6,"d8 / d4",1]
["Dagger","Pierce",0,1,0,3,"d4",1]
["Falchion","Chop",1,0,0,5,"d6 / d4",1]
["Cutlass","Chop",1,0,1,4,null,1]
["Short sword","Pierce",0.5,0.5,1,4,"2d4",1]
["Scimitar","Slash",0.5,0.5,1,6,"d8 / d4",1]
["Arming Sword","Slash",0.5,0.5,2,5,"d6 / d4",1]
["Bastard Sword","Slash",0.5,0.5,2,7,"d8 / d6",1]
["Great Sword","Slash",1,0,3,9,"d10 / d8",1]
["Staff","Bludgeon",0,1,2,4,"2d4",1]
[]
["Body Armour","Cut","Thrust","Chop","Base AC","Experience",null,null,"New Damage system"]
[" - ",1,1,1,10,{"$f":"SUM(B38:D38)/3+E38/5","v":3},null,null,1,"d2",null,null,null,"Armour translation",null,null,null,"d2"]
["Leather",3,2,2,9,{"$f":"SUM(B39:D39)/3+E39/5","v":4.1333333333333337},null,null,2,"d3","d3","Knife / club",null,1,2,null,null,"d3"]
["Padded",3,3,3,8,4.5999999999999996,null,null,3,"d4","d4","dagger",null,2,1.5,null,null,"d4"]
["Scale (Leather)",3,3,4,7,4.7333333333333334,null,null,4,"2d4","d6",null,null,3,1,null,null,"2d4"]
["Boiled Leather",4,3,4,7,5.0666666666666664,null,null,5,"d6 / d4","d8","sword / mace",null,4,"3/4",null,null,"d6 / d4"]
["Scale (Iron)",5,5,5,6,6.2,null,null,6,"d8 / d4",null,null,null,5,"1/2",null,null,"d8 / d4"]
["Mail Hauberk",7,5,4,6,6.5333333333333332,null,null,7,"d8 / d6",null,null,null,6,"1/3",null,null,"d10 / d4"]
["Mail",7,5,4,6,6.5333333333333332,null,null,8,"d10 / d6",null,null,null,7,"1/4",null,null,"d12 / d4"]
["Coat of Plates",7,6,5,6,7.2,null,null,9,"d10 / d8",null,null,null,8,"1/5",null,null,"d12 / d6"]
["Plate",8,7,6,6,8.1999999999999993,null,null,0,"d12 / d8",null,null,null,9,"1/8",null,null,"d12 / d8"]
["Hide",3,3,3,9,4.8,null,null,10,"d12 / d10",null,null,null,10,"1/10",null,null,"d12 / d10"]
["Thick Hide",6,5,4,7,6.4,null,null,11,"2d12",null,null,null,null,null,null,null,"2d12"]
["Scales",3,2,2,10,4.3333333333333339,null,null,12,"2d12+d2",null,null,null,null,null,null,null,"2d12+d2"]
["Armoured scales",7,7,7,9,8.8000000000000007,null,null,13,"2d12 + d4",null,null,null,null,null,null,null,"2d12 + d4"]
["Stone scales",8,8,6,9,9.1333333333333329,null,null,14,"2d12 + 2d4",null,null,null,null,null,null,null,"2d12 + 2d4"]
["Dragon Scales",8,8,8,9,9.8000000000000007,null,null,15,"2d12 + d6 / d4",null,null,null,null,null,null,null,"2d12 + d6 / d4"]
["Bone",7,10,5,9,9.1333333333333329,null,null,16,"2d12 + d8/d4",null,null,null,null,null,null,null,"2d12 + d8/d4"]
[null,null,null,null,null,null,null,null,17,"2d12 + d8 / d6",null,null,null,null,null,null,null,"2d12 + d10 / d4"]
[null,null,null,null,null,null,null,null,18,"2d12 + d10/d6",null,null,null,null,null,null,null,"2d12 + d12/d4"]
[null,null,null,null,null,null,null,null,19,"2d12 + d10 / d8",null,null,null,null,null,null,null,"2d12 + d12 / d6"]
[null,null,null,null,null,null,null,null,20,"2d12 + d12 / d8",null,null,null,null,null,null,null,"2d12 + d12 / d8"]
[null,null,null,null,null,null,null,null,21,"2d12 + d12 / d10",null,null,null,null,null,null,null,"2d12 + d12 / d10"]
[null,null,null,null,null,null,null,null,22,"2d12 + 2d12",null,null,null,null,null,null,null,"2d12 + 2d12"]
[null,null,null,"Defence / Attack","Defence"]
["Creature Size (over)","Feet","Weapon size","Melee attack","Ranged Def.","Melee defence","Armour"]
[0,"Miniscule",-4,1,5,1,-2]
[1,"Tiny",-3,0,4,0,-2]
[2,"Very Small",-2,-1,3,-1,-1]
[2.5,"Small",-2,-2,2,-2,-1]
[3.5,"Short",-1,-1,1,-1,0]
[4.5,"Average",0,0,0,0,0]
[6.5,"Big",1,1,-1,1,0]
[7.5,"Huge",3,2,-2,2,1]
[9,"Enormous",5,3,-3,3,1]
[12,"Massive",7,2,-4,3,2]
[16,"Giant",9,1,-5,2,2]
[21,"Titan",11,0,-6,1,3]
[]
[]
[]
["Saving Throw",null,null,null,null,"Human","Dwarf"]
["HD","Save",null,null,"Height","Weight","Weight"]
[0.5,0,null,null,0,{"$f":"5.1*E80*E80","v":0},{"$f":"10*E80*E80","v":0}]
[1,1,null,null,0.5,1.2749999999999999,{"$f":"10*E81*E81","v":2.5}]
[2,1,null,null,1,5.0999999999999996,10]
[3,2,null,null,2,20.399999999999999,40]
[4,3,null,null,3,45.9,90]
[5,3,null,null,4,81.599999999999994,160]
[6,4,null,null,5,127.5,250]
[7,5,null,null,6,183.6,360]
[8,5,null,null,7,249.89999999999998,490]
[9,6,null,null,8,326.39999999999998,640]
[10,7,null,null,9,413.09999999999997,810]
[11,7,null,null,10,510,1000]
[12,8,null,null,11,617.09999999999991,1210]
[13,9,null,null,12,734.4,1440]
[14,9,null,null,13,861.9,1690]
[15,10,null,null,14,999.59999999999991,1960]
[16,11,null,null,15,1147.5,2250]
[17,11,null,null,16,{"$f":"5.1*E97*E97","v":1305.5999999999999},2560]
[]
[]
[]
["Attackers","Multiplier"]
[-1,-1]
[0,0]
[1,0.25]
[2,0.5]
[3,0.75]
[4,1]
[5,1.1000000000000001]
[6,1.2]
[]
[]
[]
["Special Attack","Bonus","Multiplier","Parry"]
[0,0,1,0]
["Mage 1",15,1,0]
["Mage 2",30,1,0]
["Mage 3",60,1,0]
["Mage 4",120,1,0]
["Mage 5",250,1,0]
["Mage 6",500,1,0]
["Mage 7",1000,1,0]
["Mage 8",2000,1,0]
["Mage 9",4000,1,0]
["Priest 1",10,1,0]
["Priest 2",25,1,0]
["Priest 3",50,1,0]
["Priest 4",100,1,0]
["Priest 5",200,1,0]
["Priest 6",400,1,0]
["Priest 7",800,1,0]
["Poison",10,1.1000000000000001,2]
["Paralysis",10,1.1000000000000001,1]
["Stagger",10,1,0]
["Disease",2,1,1]

{"sheet":"Strength","index":11,"n_rows":21,"n_cols":5,"rows_kept":21,"cut":false,"hidden":false,"merged":[]}
[null,null,"Strength","Bench Press","Weight"]
[]
[null,null,-3,{"$f":"200*EXP(0.231*C3)","v":100.01471913915351},{"$f":"D3/14","v":7.1439085099395365}]
[null,null,-2,{"$f":"200*EXP(0.231*C4)","v":126.00446798838246},{"$f":"D4/14","v":9.000319142027319}]
[null,null,-1,158.74789320704855,11.339135229074897]
[null,null,0,200,14.285714285714286]
[null,null,1,251.97184788984629,17.99798913498902]
[null,null,2,317.44906064511918,22.6749329032228]
[null,null,3,399.94113210823281,28.567223722016628]
[null,null,4,503.86953052234276,35.99068075159591]
[null,null,5,634.80468350551996,45.343191678965709]
[null,null,6,799.76454576007461,57.126038982862475]
[null,null,7,1007.5907523597475,71.970768025696245]
[null,null,8,1269.4225189440306,90.673037067430755]
[null,null,9,1599.293689256554,114.23526351832528]
[null,null,10,2014.8849310027174,143.92035221447981]
[null,null,11,2538.4713967508001,181.3193854822]
[null,null,12,3198.1166432740924,228.4369030910066]
[null,null,13,4029.1768018652265,287.79834299037333]
[null,null,14,5076.1956212044106,362.58540151460073]
[null,null,15,6395.2919546261091,456.80656818757922]